BDBM50152785 (S)-2-Benzenesulfonylamino-3-(5-5,6,7,8-tetrahydro-[1,8]naphthyridin-2-yl-pentanoylamino)-propionic acid::CHEMBL360871
SMILES: OC(=O)[C@H](CNC(=O)CCCCc1ccc2CCCNc2n1)NS(=O)(=O)c1ccccc1
InChI Key: InChIKey=LTSYOWOYZKAEHL-IBGZPJMESA-N
Data: 1 IC50
Activity Spreadsheet -- Enzyme Inhibition Constant Data from BindingDB
Found 1 hit for monomerid = 50152785
Trg + Lig
Ki
nM
ΔG°
kcal/mole
IC50
nM
Kd
nM
EC50/IC50
nM
koff
s-1
kon
M-1s-1
pHTemp
°C
ITGAV/ITGB3
(Homo sapiens (Human))
BDBM50152785
((S)-2-Benzenesulfonylamino-3-(5-5,6,7,8-tetrahydro...)
Show SMILES OC(=O)[C@H](CNC(=O)CCCCc1ccc2CCCNc2n1)NS(=O)(=O)c1ccccc1
Show InChI InChI=1S/C22H28N4O5S/c27-20(11-5-4-8-17-13-12-16-7-6-14-23-21(16)25-17)24-15-19(22(28)29)26-32(30,31)18-9-2-1-3-10-18/h1-3,9-10,12-13,19,26H,4-8,11,14-15H2,(H,23,25)(H,24,27)(H,28,29)/t19-/m0/s1
n/an/a 0.300n/an/an/an/an/an/a
Merck Research Laboratories
Curated by ChEMBL
Assay Description
Inhibition of alpha v beta 3 receptor binding
Bioorg Med Chem Lett 14: 4411-5 (2004)
Article DOI: 10.1016/j.bmcl.2004.06.068
BindingDB Entry DOI: 10.7270/Q2PZ5B0H