BDBM50152853 2-(Carbazole-9-sulfonyl)-benzoic acid::CHEMBL364141
SMILES: OC(=O)c1ccccc1S(=O)(=O)n1c2ccccc2c2ccccc12
InChI Key: InChIKey=WVHKYPINALNKJJ-UHFFFAOYSA-N
Data: 4 IC50
Activity Spreadsheet -- Enzyme Inhibition Constant Data from BindingDB
Found 4 hits for monomerid = 50152853
Trg + Lig
Ki
nM
ΔG°
kcal/mole
IC50
nM
Kd
nM
EC50/IC50
nM
koff
s-1
kon
M-1s-1
pHTemp
°C
Fatty acid-binding protein 5 (FABP5)
(Homo sapiens (Human))
BDBM50152853
(2-(Carbazole-9-sulfonyl)-benzoic acid | CHEMBL3641...)
Show SMILES OC(=O)c1ccccc1S(=O)(=O)n1c2ccccc2c2ccccc12
Show InChI InChI=1S/C19H13NO4S/c21-19(22)15-9-3-6-12-18(15)25(23,24)20-16-10-4-1-7-13(16)14-8-2-5-11-17(14)20/h1-12H,(H,21,22)
n/an/a 1.70E+4n/an/an/an/an/an/a
Biovitrum AB
Curated by ChEMBL
Assay Description
In vitro inhibitory concentration against epithelial fatty acid binding protein(E-FABP)
Bioorg Med Chem Lett 14: 4445-8 (2004)
Article DOI: 10.1016/j.bmcl.2004.06.057
BindingDB Entry DOI: 10.7270/Q2XD1155
Fatty acid binding protein muscle
(Homo sapiens (Human))
BDBM50152853
(2-(Carbazole-9-sulfonyl)-benzoic acid | CHEMBL3641...)
Show SMILES OC(=O)c1ccccc1S(=O)(=O)n1c2ccccc2c2ccccc12
Show InChI InChI=1S/C19H13NO4S/c21-19(22)15-9-3-6-12-18(15)25(23,24)20-16-10-4-1-7-13(16)14-8-2-5-11-17(14)20/h1-12H,(H,21,22)
n/an/a 4.20E+4n/an/an/an/an/an/a
Biovitrum AB
Curated by ChEMBL
Assay Description
In vitro inhibitory concentration against heart and muscle fatty acid binding protein(H-FABP)
Bioorg Med Chem Lett 14: 4445-8 (2004)
Article DOI: 10.1016/j.bmcl.2004.06.057
BindingDB Entry DOI: 10.7270/Q2XD1155
Fatty acid-binding protein 4 (FABP4)
(Homo sapiens (Human))
BDBM50152853
(2-(Carbazole-9-sulfonyl)-benzoic acid | CHEMBL3641...)
Show SMILES OC(=O)c1ccccc1S(=O)(=O)n1c2ccccc2c2ccccc12
Show InChI InChI=1S/C19H13NO4S/c21-19(22)15-9-3-6-12-18(15)25(23,24)20-16-10-4-1-7-13(16)14-8-2-5-11-17(14)20/h1-12H,(H,21,22)
n/an/a 4.30E+3n/an/an/an/an/an/a
Biovitrum AB
Curated by ChEMBL
Assay Description
In vitro inhibitory concentration against adipocyte fatty acid binding protein(A-FABP)
Bioorg Med Chem Lett 14: 4445-8 (2004)
Article DOI: 10.1016/j.bmcl.2004.06.057
BindingDB Entry DOI: 10.7270/Q2XD1155
Intestinal fatty acid-binding protein (hIFABP)
(Homo sapiens (Human))
BDBM50152853
(2-(Carbazole-9-sulfonyl)-benzoic acid | CHEMBL3641...)
Show SMILES OC(=O)c1ccccc1S(=O)(=O)n1c2ccccc2c2ccccc12
Show InChI InChI=1S/C19H13NO4S/c21-19(22)15-9-3-6-12-18(15)25(23,24)20-16-10-4-1-7-13(16)14-8-2-5-11-17(14)20/h1-12H,(H,21,22)
n/an/a>1.00E+5n/an/an/an/an/an/a
Biovitrum AB
Curated by ChEMBL
Assay Description
In vitro inhibitory concentration against intestinal fatty acid binding protein(I-FABP)
Bioorg Med Chem Lett 14: 4445-8 (2004)
Article DOI: 10.1016/j.bmcl.2004.06.057
BindingDB Entry DOI: 10.7270/Q2XD1155