BDBM50152972 (2S,4R)-4-Methoxy-2-(4-methyl-[1,4]diazepane-1-carbothioyl)-pyrrolidine-1-carboxylic acid 2-chloro-4-(5,6,7,8-tetrahydro-thieno[3,2-b]azepine-4-carbonyl)-benzylamide::CHEMBL362483
SMILES: CO[C@@H]1C[C@H](N(C1)C(=O)NCc1ccc(cc1Cl)C(=O)N1CCCCc2sccc12)C(=S)N1CCCN(C)CC1
InChI Key: InChIKey=WWKGZIXZPOXUJL-RDGATRHJSA-N
Data: 2 EC50
Activity Spreadsheet -- Enzyme Inhibition Constant Data from BindingDB
Found 2 hits for monomerid = 50152972
Trg + Lig
Ki
nM
ΔG°
kcal/mole
IC50
nM
Kd
nM
EC50/IC50
nM
koff
s-1
kon
M-1s-1
pHTemp
°C
Vasopressin V2 receptor
(Homo sapiens (Human))
BDBM50152972
((2S,4R)-4-Methoxy-2-(4-methyl-[1,4]diazepane-1-car...)
Show SMILES CO[C@@H]1C[C@H](N(C1)C(=O)NCc1ccc(cc1Cl)C(=O)N1CCCCc2sccc12)C(=S)N1CCCN(C)CC1
Show InChI InChI=1S/C29H38ClN5O3S2/c1-32-10-5-11-33(14-13-32)28(39)25-17-22(38-2)19-35(25)29(37)31-18-21-8-7-20(16-23(21)30)27(36)34-12-4-3-6-26-24(34)9-15-40-26/h7-9,15-16,22,25H,3-6,10-14,17-19H2,1-2H3,(H,31,37)/t22-,25+/m1/s1
n/an/an/an/a 230n/an/an/an/a
Ferring Research Ltd
Curated by ChEMBL
Assay Description
Effective concentration for human Vassopressin V2 receptor
Bioorg Med Chem Lett 14: 4585-9 (2004)
Article DOI: 10.1016/j.bmcl.2004.04.107
BindingDB Entry DOI: 10.7270/Q2DF6QPR
Oxytocin receptor
(Homo sapiens (Human))
BDBM50152972
((2S,4R)-4-Methoxy-2-(4-methyl-[1,4]diazepane-1-car...)
Show SMILES CO[C@@H]1C[C@H](N(C1)C(=O)NCc1ccc(cc1Cl)C(=O)N1CCCCc2sccc12)C(=S)N1CCCN(C)CC1
Show InChI InChI=1S/C29H38ClN5O3S2/c1-32-10-5-11-33(14-13-32)28(39)25-17-22(38-2)19-35(25)29(37)31-18-21-8-7-20(16-23(21)30)27(36)34-12-4-3-6-26-24(34)9-15-40-26/h7-9,15-16,22,25H,3-6,10-14,17-19H2,1-2H3,(H,31,37)/t22-,25+/m1/s1
Reactome pathway
n/an/an/an/a 430n/an/an/an/a
Ferring Research Ltd
Curated by ChEMBL
Assay Description
Effective concentration for human Oxytocin receptor
Bioorg Med Chem Lett 14: 4585-9 (2004)
Article DOI: 10.1016/j.bmcl.2004.04.107
BindingDB Entry DOI: 10.7270/Q2DF6QPR