BDBM50153024 (S)-3-(2-Isopropyl-pyrimidin-5-yl)-9-(5,6,7,8-tetrahydro-[1,8]naphthyridin-2-yl)-nonanoic acid::CHEMBL361936
SMILES: CC(C)c1ncc(cn1)[C@@H](CCCCCCc1ccc2CCCNc2n1)CC(O)=O
InChI Key: InChIKey=TZEHAFMMPSPZTD-IBGZPJMESA-N
Data: 1 IC50
Activity Spreadsheet -- Enzyme Inhibition Constant Data from BindingDB
Found 1 hit for monomerid = 50153024
Trg + Lig
Ki
nM
ΔG°
kcal/mole
IC50
nM
Kd
nM
EC50/IC50
nM
koff
s-1
kon
M-1s-1
pHTemp
°C
ITGAV/ITGB3
(Homo sapiens (Human))
BDBM50153024
((S)-3-(2-Isopropyl-pyrimidin-5-yl)-9-(5,6,7,8-tetr...)
Show SMILES CC(C)c1ncc(cn1)[C@@H](CCCCCCc1ccc2CCCNc2n1)CC(O)=O
Show InChI InChI=1S/C24H34N4O2/c1-17(2)23-26-15-20(16-27-23)19(14-22(29)30)8-5-3-4-6-10-21-12-11-18-9-7-13-25-24(18)28-21/h11-12,15-17,19H,3-10,13-14H2,1-2H3,(H,25,28)(H,29,30)/t19-/m0/s1
n/an/a 0.520n/an/an/an/an/an/a
Merck Research Laboratories
Curated by ChEMBL
Assay Description
Inhibitory activity against alpha v beta-3 receptor using scintillation proximity assay (SPAV3)
J Med Chem 47: 4829-37 (2004)
Article DOI: 10.1021/jm049874c
BindingDB Entry DOI: 10.7270/Q2CJ8FQC