BDBM50153030 (S)-3-(6-Methoxy-pyridin-3-yl)-9-(5,6,7,8-tetrahydro-[1,8]naphthyridin-2-yl)-nonanoic acid::CHEMBL180489
SMILES: COc1ccc(cn1)[C@@H](CCCCCCc1ccc2CCCNc2n1)CC(O)=O
InChI Key: InChIKey=SQIDFFKYMURYAR-SFHVURJKSA-N
Data: 2 IC50
Activity Spreadsheet -- Enzyme Inhibition Constant Data from BindingDB
Found 2 hits for monomerid = 50153030
Trg + Lig
Ki
nM
ΔG°
kcal/mole
IC50
nM
Kd
nM
EC50/IC50
nM
koff
s-1
kon
M-1s-1
pHTemp
°C
ITGAV/ITGB3
(Homo sapiens (Human))
BDBM50153030
((S)-3-(6-Methoxy-pyridin-3-yl)-9-(5,6,7,8-tetrahyd...)
Show SMILES COc1ccc(cn1)[C@@H](CCCCCCc1ccc2CCCNc2n1)CC(O)=O
Show InChI InChI=1S/C23H31N3O3/c1-29-21-13-11-19(16-25-21)18(15-22(27)28)7-4-2-3-5-9-20-12-10-17-8-6-14-24-23(17)26-20/h10-13,16,18H,2-9,14-15H2,1H3,(H,24,26)(H,27,28)/t18-/m0/s1
n/an/a 0.650n/an/an/an/an/an/a
Merck Research Laboratories
Curated by ChEMBL
Assay Description
Inhibitory activity against alpha v beta-3 receptor using scintillation proximity assay (SPAV3)
J Med Chem 47: 4829-37 (2004)
Article DOI: 10.1021/jm049874c
BindingDB Entry DOI: 10.7270/Q2CJ8FQC
ITGAV/ITGB3
(Homo sapiens (Human))
BDBM50153030
((S)-3-(6-Methoxy-pyridin-3-yl)-9-(5,6,7,8-tetrahyd...)
Show SMILES COc1ccc(cn1)[C@@H](CCCCCCc1ccc2CCCNc2n1)CC(O)=O
Show InChI InChI=1S/C23H31N3O3/c1-29-21-13-11-19(16-25-21)18(15-22(27)28)7-4-2-3-5-9-20-12-10-17-8-6-14-24-23(17)26-20/h10-13,16,18H,2-9,14-15H2,1H3,(H,24,26)(H,27,28)/t18-/m0/s1
n/an/a 0.650n/an/an/an/an/an/a
Merck Research Laboratories
Curated by ChEMBL
Assay Description
Inhibition of 2(S)-(4-125-iodo-benzenesulfonylamino)-3-4-[2-(5,6,7,8-tetrahydro- [1,8]naphthyridin-2-yl)-ethyl]-benzoylamino-propionic acid binding t...
Bioorg Med Chem Lett 15: 1647-50 (2005)
Article DOI: 10.1016/j.bmcl.2005.01.051
BindingDB Entry DOI: 10.7270/Q25D8RBX