null
SMILES: CCOC(=O)c1c(C)n(Cc2ccc(OC)cc2)c2ccc(OCCCN3CCCCC3)cc12
InChI Key: InChIKey=UZZNUJZQWYCOMY-UHFFFAOYSA-N
Activity Spreadsheet -- Enzyme Inhibition Constant Data from BindingDB
Found 1 hit for monomerid = 50153185
Trg + Lig
Ki
nM
ΔG°
kcal/mole
IC50
nM
Kd
nM
EC50/IC50
nM
koff
s-1
kon
M-1s-1
pHTemp
°C
Quinolone resistance protein NorA
(Staphylococcus aureus)
BDBM50153185
(CHEMBL3775726)
Show SMILES CCOC(=O)c1c(C)n(Cc2ccc(OC)cc2)c2ccc(OCCCN3CCCCC3)cc12
Show InChI InChI=1S/C28H36N2O4/c1-4-33-28(31)27-21(2)30(20-22-9-11-23(32-3)12-10-22)26-14-13-24(19-25(26)27)34-18-8-17-29-15-6-5-7-16-29/h9-14,19H,4-8,15-18,20H2,1-3H3
n/an/a 7.10E+3n/an/an/an/an/an/a
University of Perugia
Curated by ChEMBL
Assay Description
Inhibition of NorA efflux pump in Staphylococcus aureus 1199B assessed as reduction in EtBr efflux incubated for 20 mins measured for 5 mins by real-...
J Med Chem 59: 867-91 (2016)
BindingDB Entry DOI: 10.7270/Q28W3G57