null
SMILES: CCOC(=O)c1c(C)n(Cc2ccccc2)c2ccc(OCCCCN)cc12
InChI Key: InChIKey=VVWLLFFDCNQBTC-UHFFFAOYSA-N
Activity Spreadsheet -- Enzyme Inhibition Constant Data from BindingDB
Found 1 hit for monomerid = 50153283
Trg + Lig
Ki
nM
ΔG°
kcal/mole
IC50
nM
Kd
nM
EC50/IC50
nM
koff
s-1
kon
M-1s-1
pHTemp
°C
Quinolone resistance protein NorA
(Staphylococcus aureus)
BDBM50153283
(CHEMBL3774445)
Show SMILES CCOC(=O)c1c(C)n(Cc2ccccc2)c2ccc(OCCCCN)cc12
Show InChI InChI=1S/C23H28N2O3/c1-3-27-23(26)22-17(2)25(16-18-9-5-4-6-10-18)21-12-11-19(15-20(21)22)28-14-8-7-13-24/h4-6,9-12,15H,3,7-8,13-14,16,24H2,1-2H3
n/an/a 6.70E+3n/an/an/an/an/an/a
University of Perugia
Curated by ChEMBL
Assay Description
Inhibition of NorA efflux pump in Staphylococcus aureus 1199B assessed as reduction in EtBr efflux incubated for 20 mins measured for 5 mins by real-...
J Med Chem 59: 867-91 (2016)
BindingDB Entry DOI: 10.7270/Q28W3G57