BDBM50153329 CHEMBL3775957
SMILES: OC(=O)c1ccncc1NCC1CC1
InChI Key: InChIKey=KSBDUYJBMHLFMK-UHFFFAOYSA-N
Data: 2 IC50
Activity Spreadsheet -- Enzyme Inhibition Constant Data from BindingDB
Found 2 hits for monomerid = 50153329
Trg + Lig
Ki
nM
ΔG°
kcal/mole
IC50
nM
Kd
nM
EC50/IC50
nM
koff
s-1
kon
M-1s-1
pHTemp
°C
Lysine-specific demethylase 4C
(Homo sapiens (Human))
BDBM50153329
(CHEMBL3775957)
Show SMILES OC(=O)c1ccncc1NCC1CC1
Show InChI InChI=1S/C10H12N2O2/c13-10(14)8-3-4-11-6-9(8)12-5-7-1-2-7/h3-4,6-7,12H,1-2,5H2,(H,13,14)
n/an/a 126n/an/an/an/an/an/a
GlaxoSmithKline R&D
Curated by ChEMBL
Assay Description
Inhibition of KDM4C (unknown origin) using H3K9Me3 peptide as substrate assessed as demethylation of substrate by Rapidfire mass spectrometric analys...
J Med Chem 59: 1357-69 (2016)
BindingDB Entry DOI: 10.7270/Q2542QFT
Lysine-specific demethylase 4C
(Homo sapiens (Human))
BDBM50153329
(CHEMBL3775957)
Show SMILES OC(=O)c1ccncc1NCC1CC1
Show InChI InChI=1S/C10H12N2O2/c13-10(14)8-3-4-11-6-9(8)12-5-7-1-2-7/h3-4,6-7,12H,1-2,5H2,(H,13,14)
n/an/a 3.16E+4n/an/an/an/an/an/a
GlaxoSmithKline R&D
Curated by ChEMBL
Assay Description
Inhibition of full length human HALO-tagged KDM4C expressed in human U2OS cells assessed as level of H3K9Me3 demethylation incubated overnight by Hoe...
J Med Chem 59: 1357-69 (2016)
BindingDB Entry DOI: 10.7270/Q2542QFT