BDBM50153445 CHEMBL3775280::US9630914, Example 15
SMILES: CCCCCCNC(=O)Oc1cccc(c1)-c1ccc(cc1F)C(C)CO
InChI Key: InChIKey=COSYQYFCEAMLKE-UHFFFAOYSA-N
Data: 7 IC50
Activity Spreadsheet -- Enzyme Inhibition Constant Data from BindingDB
Found 7 hits for monomerid = 50153445
Trg + Lig
Ki
nM
ΔG°
kcal/mole
IC50
nM
Kd
nM
EC50/IC50
nM
koff
s-1
kon
M-1s-1
pHTemp
°C
Fatty-acid amide hydrolase 1 [30-579]
(Rattus norvegicus (rat))
BDBM50153445
(CHEMBL3775280 | US9630914, Example 15)
Show SMILES CCCCCCNC(=O)Oc1cccc(c1)-c1ccc(cc1F)C(C)CO
Show InChI InChI=1S/C9H12N2O/c10-9(11)8-3-1-7(2-4-8)5-6-12/h1-4,12H,5-6H2,(H3,10,11)
n/an/a 3n/an/an/an/an/an/a
Fondazione Istituto Italiano di Tecnologia
Curated by ChEMBL
Assay Description
Inhibition of FAAH in Sprague-Dawley rat brain homogenates preincubated for 10 mins followed by addition of substrate measured after 30 mins by liqui...
Eur J Med Chem 109: 216-37 (2016)
BindingDB Entry DOI: 10.7270/Q21C1ZRJ
Prostaglandin G/H synthase 1
(Ovis aries (Sheep))
BDBM50153445
(CHEMBL3775280 | US9630914, Example 15)
Show SMILES CCCCCCNC(=O)Oc1cccc(c1)-c1ccc(cc1F)C(C)CO
Show InChI InChI=1S/C9H12N2O/c10-9(11)8-3-1-7(2-4-8)5-6-12/h1-4,12H,5-6H2,(H3,10,11)
n/an/a 1.10E+3n/an/an/an/an/an/a
Fondazione Istituto Italiano di Tecnologia
Curated by ChEMBL
Assay Description
Inhibition of ovine COX1 assessed as production of PGF2-alpha preincubated with compound followed by the addition of 5 uM arachidonic acid as substra...
Eur J Med Chem 109: 216-37 (2016)
BindingDB Entry DOI: 10.7270/Q21C1ZRJ
Prostaglandin G/H synthase 2
(Homo sapiens (Human))
BDBM50153445
(CHEMBL3775280 | US9630914, Example 15)
Show SMILES CCCCCCNC(=O)Oc1cccc(c1)-c1ccc(cc1F)C(C)CO
Show InChI InChI=1S/C9H12N2O/c10-9(11)8-3-1-7(2-4-8)5-6-12/h1-4,12H,5-6H2,(H3,10,11)
NCI pathway
Reactome pathway
n/an/a>1.00E+5n/an/an/an/an/an/a
Fondazione Istituto Italiano di Tecnologia
Curated by ChEMBL
Assay Description
Inhibition of recombinant human COX2 assessed as production of PGF2-alpha preincubated with compound followed by the addition of 5 uM arachidonic aci...
Eur J Med Chem 109: 216-37 (2016)
BindingDB Entry DOI: 10.7270/Q21C1ZRJ
Prostaglandin G/H synthase 2
(Homo sapiens (Human))
BDBM50153445
(CHEMBL3775280 | US9630914, Example 15)
Show SMILES CCCCCCNC(=O)Oc1cccc(c1)-c1ccc(cc1F)C(C)CO
Show InChI InChI=1S/C9H12N2O/c10-9(11)8-3-1-7(2-4-8)5-6-12/h1-4,12H,5-6H2,(H3,10,11)
NCI pathway
Reactome pathway
US Patent
n/an/a>3.00E+7n/an/an/an/an/an/a
Fondazione Istituto Italiano Di Tecnologia; The Regents of the University of California; Alma Mater Studiorum—Universita' Di Bologna
US Patent
Assay Description
COX activity was measured using a commercial kit (COX Inhibitor Screening Assay Kit Cayman Chemical N. 560131) which includes both ovine COX-1 and hu...
US Patent US9630914 (2017)
BindingDB Entry DOI: 10.7270/Q2JW8H0S
Fatty-acid amide hydrolase 1
(Homo sapiens (Human))
BDBM50153445
(CHEMBL3775280 | US9630914, Example 15)
Show SMILES CCCCCCNC(=O)Oc1cccc(c1)-c1ccc(cc1F)C(C)CO
Show InChI InChI=1S/C9H12N2O/c10-9(11)8-3-1-7(2-4-8)5-6-12/h1-4,12H,5-6H2,(H3,10,11)
US Patent
n/an/a 9.10n/an/an/an/an/an/a
Fondazione Istituto Italiano Di Tecnologia; The Regents of the University of California; Alma Mater Studiorum—Universita' Di Bologna
US Patent
Assay Description
Human recombinant FAAH was obtained from a HEK-293 FAAH-1 overexpressing stable cell line. Cells were grown in DMEM medium containing 10% FBS, 1% pen...
US Patent US9630914 (2017)
BindingDB Entry DOI: 10.7270/Q2JW8H0S
Prostaglandin G/H synthase 1
(Ovis aries (Sheep))
BDBM50153445
(CHEMBL3775280 | US9630914, Example 15)
Show SMILES CCCCCCNC(=O)Oc1cccc(c1)-c1ccc(cc1F)C(C)CO
Show InChI InChI=1S/C9H12N2O/c10-9(11)8-3-1-7(2-4-8)5-6-12/h1-4,12H,5-6H2,(H3,10,11)
US Patent
n/an/a 1.10E+3n/an/an/an/an/an/a
Fondazione Istituto Italiano Di Tecnologia; The Regents of the University of California; Alma Mater Studiorum—Universita' Di Bologna
US Patent
Assay Description
COX activity was measured using a commercial kit (COX Inhibitor Screening Assay Kit Cayman Chemical N. 560131) which includes both ovine COX-1 and hu...
US Patent US9630914 (2017)
BindingDB Entry DOI: 10.7270/Q2JW8H0S
Fatty-acid amide hydrolase 1 [30-579]
(Rattus norvegicus (rat))
BDBM50153445
(CHEMBL3775280 | US9630914, Example 15)
Show SMILES CCCCCCNC(=O)Oc1cccc(c1)-c1ccc(cc1F)C(C)CO
Show InChI InChI=1S/C9H12N2O/c10-9(11)8-3-1-7(2-4-8)5-6-12/h1-4,12H,5-6H2,(H3,10,11)
US Patent
n/an/a 3.30n/an/an/an/an/an/a
Fondazione Istituto Italiano Di Tecnologia; The Regents of the University of California; Alma Mater Studiorum—Universita' Di Bologna
US Patent
Assay Description
Rat FAAH was prepared from male Sprague Dawley rat brains, homogenized in a potter in 20 mM of Tris HCl pH 7.4, 0.32 M sucrose.The radiometric assay ...
US Patent US9630914 (2017)
BindingDB Entry DOI: 10.7270/Q2JW8H0S