BDBM50153508 Benzo[b]thiophen-3-yl-[(4aR,5S)-1-(4-fluoro-phenyl)-4a-methyl-4,4a,5,6,7,8-hexahydro-1H-benzo[f]indazol-5-yl]-methanol::CHEMBL363760
SMILES: C[C@]12Cc3cnn(c3C=C1CCC[C@@H]2C(O)c1csc2ccccc12)-c1ccc(F)cc1
InChI Key: InChIKey=GSBXDPQKEHNRQR-IDERCBEYSA-N
Data: 1 IC50  3 EC50
Activity Spreadsheet -- Enzyme Inhibition Constant Data from BindingDB
Found 4 hits for monomerid = 50153508
Trg + Lig
Ki
nM
ΔG°
kcal/mole
IC50
nM
Kd
nM
EC50/IC50
nM
koff
s-1
kon
M-1s-1
pHTemp
°C
Glucocorticoid
(RAT)
BDBM50153508
(Benzo[b]thiophen-3-yl-[(4aR,5S)-1-(4-fluoro-phenyl...)
Show SMILES C[C@]12Cc3cnn(c3C=C1CCC[C@@H]2C(O)c1csc2ccccc12)-c1ccc(F)cc1 |c:9|
Show InChI InChI=1S/C27H25FN2OS/c1-27-14-17-15-29-30(20-11-9-19(28)10-12-20)24(17)13-18(27)5-4-7-23(27)26(31)22-16-32-25-8-3-2-6-21(22)25/h2-3,6,8-13,15-16,23,26,31H,4-5,7,14H2,1H3/t23-,26?,27+/m1/s1
n/an/an/an/a 1.80n/an/an/an/a
University of California--San Francisco
Curated by ChEMBL
Assay Description
Repression of AP1-luciferase reporter activity in TPA-stimulated U2OS cells expressing rat glucocorticoid receptor
Bioorg Med Chem Lett 14: 5199-203 (2004)
Article DOI: 10.1016/j.bmcl.2004.07.052
BindingDB Entry DOI: 10.7270/Q2G73D65
Glucocorticoid
(RAT)
BDBM50153508
(Benzo[b]thiophen-3-yl-[(4aR,5S)-1-(4-fluoro-phenyl...)
Show SMILES C[C@]12Cc3cnn(c3C=C1CCC[C@@H]2C(O)c1csc2ccccc12)-c1ccc(F)cc1 |c:9|
Show InChI InChI=1S/C27H25FN2OS/c1-27-14-17-15-29-30(20-11-9-19(28)10-12-20)24(17)13-18(27)5-4-7-23(27)26(31)22-16-32-25-8-3-2-6-21(22)25/h2-3,6,8-13,15-16,23,26,31H,4-5,7,14H2,1H3/t23-,26?,27+/m1/s1
n/an/an/an/a 22n/an/an/an/a
University of California--San Francisco
Curated by ChEMBL
Assay Description
Repression of NFkB-luciferase reporter activity in TPA stimulated U2OS cells expressing rat glucocorticoid receptor
Bioorg Med Chem Lett 14: 5199-203 (2004)
Article DOI: 10.1016/j.bmcl.2004.07.052
BindingDB Entry DOI: 10.7270/Q2G73D65
Glucocorticoid
(RAT)
BDBM50153508
(Benzo[b]thiophen-3-yl-[(4aR,5S)-1-(4-fluoro-phenyl...)
Show SMILES C[C@]12Cc3cnn(c3C=C1CCC[C@@H]2C(O)c1csc2ccccc12)-c1ccc(F)cc1 |c:9|
Show InChI InChI=1S/C27H25FN2OS/c1-27-14-17-15-29-30(20-11-9-19(28)10-12-20)24(17)13-18(27)5-4-7-23(27)26(31)22-16-32-25-8-3-2-6-21(22)25/h2-3,6,8-13,15-16,23,26,31H,4-5,7,14H2,1H3/t23-,26?,27+/m1/s1
n/an/a 1.80n/an/an/an/an/an/a
University of California--San Francisco
Curated by ChEMBL
Assay Description
Inhibition against U2OS cells expressing rat Glucocorticoid receptor
Bioorg Med Chem Lett 14: 5199-203 (2004)
Article DOI: 10.1016/j.bmcl.2004.07.052
BindingDB Entry DOI: 10.7270/Q2G73D65
Glucocorticoid
(RAT)
BDBM50153508
(Benzo[b]thiophen-3-yl-[(4aR,5S)-1-(4-fluoro-phenyl...)
Show SMILES C[C@]12Cc3cnn(c3C=C1CCC[C@@H]2C(O)c1csc2ccccc12)-c1ccc(F)cc1 |c:9|
Show InChI InChI=1S/C27H25FN2OS/c1-27-14-17-15-29-30(20-11-9-19(28)10-12-20)24(17)13-18(27)5-4-7-23(27)26(31)22-16-32-25-8-3-2-6-21(22)25/h2-3,6,8-13,15-16,23,26,31H,4-5,7,14H2,1H3/t23-,26?,27+/m1/s1
n/an/an/an/a 20n/an/an/an/a
University of California--San Francisco
Curated by ChEMBL
Assay Description
Effective concentration against MMTV in transactivation assay in U2OS cells expressing rat GR
Bioorg Med Chem Lett 14: 5199-203 (2004)
Article DOI: 10.1016/j.bmcl.2004.07.052
BindingDB Entry DOI: 10.7270/Q2G73D65