BDBM50153513 1-[(4aR,5S)-1-(4-Fluoro-phenyl)-4a-methyl-4,4a,5,6,7,8-hexahydro-1H-benzo[f]indazol-5-yl]-3-phenyl-propan-1-ol::CHEMBL186805
SMILES: C[C@]12Cc3cnn(c3C=C1CCC[C@@H]2C(O)CCc1ccccc1)-c1ccc(F)cc1
InChI Key: InChIKey=HEWIVYFAXYIWTQ-YZLRFICZSA-N
Data: 1 IC50  3 EC50
Activity Spreadsheet -- Enzyme Inhibition Constant Data from BindingDB
Found 4 hits for monomerid = 50153513
Trg + Lig
Ki
nM
ΔG°
kcal/mole
IC50
nM
Kd
nM
EC50/IC50
nM
koff
s-1
kon
M-1s-1
pHTemp
°C
Glucocorticoid receptor
(RAT)
BDBM50153513
(1-[(4aR,5S)-1-(4-Fluoro-phenyl)-4a-methyl-4,4a,5,6...)
Show SMILES C[C@]12Cc3cnn(c3C=C1CCC[C@@H]2C(O)CCc1ccccc1)-c1ccc(F)cc1 |c:9|
Show InChI InChI=1S/C27H29FN2O/c1-27-17-20-18-29-30(23-13-11-22(28)12-14-23)25(20)16-21(27)8-5-9-24(27)26(31)15-10-19-6-3-2-4-7-19/h2-4,6-7,11-14,16,18,24,26,31H,5,8-10,15,17H2,1H3/t24-,26?,27+/m1/s1
n/an/a 8.60n/an/an/an/an/an/a
University of California--San Francisco
Curated by ChEMBL
Assay Description
Inhibition against U2OS cells expressing rat Glucocorticoid receptor
Bioorg Med Chem Lett 14: 5199-203 (2004)
Article DOI: 10.1016/j.bmcl.2004.07.052
BindingDB Entry DOI: 10.7270/Q2G73D65
Glucocorticoid receptor
(RAT)
BDBM50153513
(1-[(4aR,5S)-1-(4-Fluoro-phenyl)-4a-methyl-4,4a,5,6...)
Show SMILES C[C@]12Cc3cnn(c3C=C1CCC[C@@H]2C(O)CCc1ccccc1)-c1ccc(F)cc1 |c:9|
Show InChI InChI=1S/C27H29FN2O/c1-27-17-20-18-29-30(23-13-11-22(28)12-14-23)25(20)16-21(27)8-5-9-24(27)26(31)15-10-19-6-3-2-4-7-19/h2-4,6-7,11-14,16,18,24,26,31H,5,8-10,15,17H2,1H3/t24-,26?,27+/m1/s1
n/an/an/an/a 3n/an/an/an/a
University of California--San Francisco
Curated by ChEMBL
Assay Description
Repression of NFkB-luciferase reporter activity in TPA stimulated U2OS cells expressing rat glucocorticoid receptor
Bioorg Med Chem Lett 14: 5199-203 (2004)
Article DOI: 10.1016/j.bmcl.2004.07.052
BindingDB Entry DOI: 10.7270/Q2G73D65
Glucocorticoid receptor
(RAT)
BDBM50153513
(1-[(4aR,5S)-1-(4-Fluoro-phenyl)-4a-methyl-4,4a,5,6...)
Show SMILES C[C@]12Cc3cnn(c3C=C1CCC[C@@H]2C(O)CCc1ccccc1)-c1ccc(F)cc1 |c:9|
Show InChI InChI=1S/C27H29FN2O/c1-27-17-20-18-29-30(23-13-11-22(28)12-14-23)25(20)16-21(27)8-5-9-24(27)26(31)15-10-19-6-3-2-4-7-19/h2-4,6-7,11-14,16,18,24,26,31H,5,8-10,15,17H2,1H3/t24-,26?,27+/m1/s1
n/an/an/an/a 11n/an/an/an/a
University of California--San Francisco
Curated by ChEMBL
Assay Description
Effective concentration against MMTV in transactivation assay in U2OS cells expressing rat GR
Bioorg Med Chem Lett 14: 5199-203 (2004)
Article DOI: 10.1016/j.bmcl.2004.07.052
BindingDB Entry DOI: 10.7270/Q2G73D65
Glucocorticoid receptor
(RAT)
BDBM50153513
(1-[(4aR,5S)-1-(4-Fluoro-phenyl)-4a-methyl-4,4a,5,6...)
Show SMILES C[C@]12Cc3cnn(c3C=C1CCC[C@@H]2C(O)CCc1ccccc1)-c1ccc(F)cc1 |c:9|
Show InChI InChI=1S/C27H29FN2O/c1-27-17-20-18-29-30(23-13-11-22(28)12-14-23)25(20)16-21(27)8-5-9-24(27)26(31)15-10-19-6-3-2-4-7-19/h2-4,6-7,11-14,16,18,24,26,31H,5,8-10,15,17H2,1H3/t24-,26?,27+/m1/s1
n/an/an/an/a 7n/an/an/an/a
University of California--San Francisco
Curated by ChEMBL
Assay Description
Repression of AP1-luciferase reporter activity in TPA-stimulated U2OS cells expressing rat glucocorticoid receptor
Bioorg Med Chem Lett 14: 5199-203 (2004)
Article DOI: 10.1016/j.bmcl.2004.07.052
BindingDB Entry DOI: 10.7270/Q2G73D65