BDBM50153554 3-(3-Fluoro-phenyl)-4-[1-(3-5,6,7,8-tetrahydro-[1,8]naphthyridin-2-yl-propionyl)-piperidin-4-yl]-butyric acid::CHEMBL368693
SMILES: OC(=O)CC(CC1CCN(CC1)C(=O)CCc1ccc2CCCNc2n1)c1cccc(F)c1
InChI Key: InChIKey=PSWDFAPCKFYFPG-UHFFFAOYSA-N
Data: 2 IC50
Activity Spreadsheet -- Enzyme Inhibition Constant Data from BindingDB
Found 2 hits for monomerid = 50153554
Trg + Lig
Ki
nM
ΔG°
kcal/mole
IC50
nM
Kd
nM
EC50/IC50
nM
koff
s-1
kon
M-1s-1
pHTemp
°C
ITGAV/ITGB3
(Homo sapiens (Human))
BDBM50153554
(3-(3-Fluoro-phenyl)-4-[1-(3-5,6,7,8-tetrahydro-[1,...)
Show SMILES OC(=O)CC(CC1CCN(CC1)C(=O)CCc1ccc2CCCNc2n1)c1cccc(F)c1
Show InChI InChI=1S/C26H32FN3O3/c27-22-5-1-3-20(16-22)21(17-25(32)33)15-18-10-13-30(14-11-18)24(31)9-8-23-7-6-19-4-2-12-28-26(19)29-23/h1,3,5-7,16,18,21H,2,4,8-15,17H2,(H,28,29)(H,32,33)
n/an/a 1n/an/an/an/an/an/a
Johnson & Johnson Pharmaceutical Research and Development
Curated by ChEMBL
Assay Description
Inhibition of human vitronectin binding to immobilized Alpha v beta-3
Bioorg Med Chem Lett 14: 5227-32 (2004)
Article DOI: 10.1016/j.bmcl.2004.06.061
BindingDB Entry DOI: 10.7270/Q2TH8M5Z
Integrin alpha-IIb/beta-3
(Homo sapiens (Human))
BDBM50153554
(3-(3-Fluoro-phenyl)-4-[1-(3-5,6,7,8-tetrahydro-[1,...)
Show SMILES OC(=O)CC(CC1CCN(CC1)C(=O)CCc1ccc2CCCNc2n1)c1cccc(F)c1
Show InChI InChI=1S/C26H32FN3O3/c27-22-5-1-3-20(16-22)21(17-25(32)33)15-18-10-13-30(14-11-18)24(31)9-8-23-7-6-19-4-2-12-28-26(19)29-23/h1,3,5-7,16,18,21H,2,4,8-15,17H2,(H,28,29)(H,32,33)
n/an/a>1.00E+4n/an/an/an/an/an/a
Johnson & Johnson Pharmaceutical Research and Development
Curated by ChEMBL
Assay Description
Inhibition of human Biotinylated Fg binding to immobilized Alpha II beta-3
Bioorg Med Chem Lett 14: 5227-32 (2004)
Article DOI: 10.1016/j.bmcl.2004.06.061
BindingDB Entry DOI: 10.7270/Q2TH8M5Z