null
SMILES: COc1ncc(C(CC2CCN(CC2)C(=O)CCc2ccc3CCCNc3n2)CC(O)=O)c(OC)n1
InChI Key: InChIKey=HRJYJLGVTFNBBO-UHFFFAOYSA-N
Activity Spreadsheet -- Enzyme Inhibition Constant Data from BindingDB
Found 2 hits for monomerid = 50153555
Trg + Lig
Ki
nM
ΔG°
kcal/mole
IC50
nM
Kd
nM
EC50/IC50
nM
koff
s-1
kon
M-1s-1
pHTemp
°C
Integrin alpha-IIb/beta-3
(Homo sapiens (Human))
BDBM50153555
(3-(2,4-Dimethoxy-pyrimidin-5-yl)-4-[1-(3-5,6,7,8-t...)
Show SMILES COc1ncc(C(CC2CCN(CC2)C(=O)CCc2ccc3CCCNc3n2)CC(O)=O)c(OC)n1
Show InChI InChI=1S/C26H35N5O5/c1-35-25-21(16-28-26(30-25)36-2)19(15-23(33)34)14-17-9-12-31(13-10-17)22(32)8-7-20-6-5-18-4-3-11-27-24(18)29-20/h5-6,16-17,19H,3-4,7-15H2,1-2H3,(H,27,29)(H,33,34)
n/an/a 1.47E+3n/an/an/an/an/an/a
Johnson & Johnson Pharmaceutical Research and Development
Curated by ChEMBL
Assay Description
Inhibition of human Biotinylated Fg binding to immobilized Alpha II beta-3
Bioorg Med Chem Lett 14: 5227-32 (2004)
Article DOI: 10.1016/j.bmcl.2004.06.061
BindingDB Entry DOI: 10.7270/Q2TH8M5Z
Integrin alpha-V/beta-3
(Homo sapiens (Human))
BDBM50153555
(3-(2,4-Dimethoxy-pyrimidin-5-yl)-4-[1-(3-5,6,7,8-t...)
Show SMILES COc1ncc(C(CC2CCN(CC2)C(=O)CCc2ccc3CCCNc3n2)CC(O)=O)c(OC)n1
Show InChI InChI=1S/C26H35N5O5/c1-35-25-21(16-28-26(30-25)36-2)19(15-23(33)34)14-17-9-12-31(13-10-17)22(32)8-7-20-6-5-18-4-3-11-27-24(18)29-20/h5-6,16-17,19H,3-4,7-15H2,1-2H3,(H,27,29)(H,33,34)
n/an/a 1.5n/an/an/an/an/an/a
Johnson & Johnson Pharmaceutical Research and Development
Curated by ChEMBL
Assay Description
Inhibition of human vitronectin binding to immobilized Alpha v beta-3
Bioorg Med Chem Lett 14: 5227-32 (2004)
Article DOI: 10.1016/j.bmcl.2004.06.061
BindingDB Entry DOI: 10.7270/Q2TH8M5Z