BDBM50153646 CHEMBL3775781
SMILES: CCn1c(CCC2CCCCC2)nnc1CCC(=O)Nc1cccc(Cl)c1C
InChI Key: InChIKey=WSGYCZCOEBMEQX-UHFFFAOYSA-N
Data: 2 EC50
Activity Spreadsheet -- Enzyme Inhibition Constant Data from BindingDB
Found 2 hits for monomerid = 50153646
Trg + Lig
Ki
nM
ΔG°
kcal/mole
IC50
nM
Kd
nM
EC50/IC50
nM
koff
s-1
kon
M-1s-1
pHTemp
°C
Nuclear receptor ROR-gamma
(Mus musculus)
BDBM50153646
(CHEMBL3775781)
Show SMILES CCn1c(CCC2CCCCC2)nnc1CCC(=O)Nc1cccc(Cl)c1C
Show InChI InChI=1S/C22H31ClN4O/c1-3-27-20(13-12-17-8-5-4-6-9-17)25-26-21(27)14-15-22(28)24-19-11-7-10-18(23)16(19)2/h7,10-11,17H,3-6,8-9,12-15H2,1-2H3,(H,24,28)
Reactome pathway
n/an/an/an/a 640n/an/an/an/a
Central Pharmaceutical Research Institute
Curated by ChEMBL
Assay Description
Inhibition of mouse RORgamma ligand binding domain (Isoleucine 251 to Lysine 516) expressed in CHOK1 cells incubated for 2 days by Gal4 luciferase re...
ACS Med Chem Lett 7: 23-7 (2016)
BindingDB Entry DOI: 10.7270/Q2N58P7P
Nuclear receptor ROR-gamma (RORC)
(Homo sapiens (Human))
BDBM50153646
(CHEMBL3775781)
Show SMILES CCn1c(CCC2CCCCC2)nnc1CCC(=O)Nc1cccc(Cl)c1C
Show InChI InChI=1S/C22H31ClN4O/c1-3-27-20(13-12-17-8-5-4-6-9-17)25-26-21(27)14-15-22(28)24-19-11-7-10-18(23)16(19)2/h7,10-11,17H,3-6,8-9,12-15H2,1-2H3,(H,24,28)
n/an/an/an/a 960n/an/an/an/a
Central Pharmaceutical Research Institute
Curated by ChEMBL
Assay Description
Inhibition of human RORgamma ligand binding domain (Serine 253 to Lysine 518 residues) expressed in CHOK1 cells incubated for 2 days by Gal4 lucifera...
ACS Med Chem Lett 7: 23-7 (2016)
BindingDB Entry DOI: 10.7270/Q2N58P7P