null
SMILES: N#Cc1ccc(OCc2cncn2Cc2ccc(C#N)c(c2)-c2cccc3ccccc23)nc1
InChI Key: InChIKey=UTHUXMFOXAKPJE-UHFFFAOYSA-N
Activity Spreadsheet -- Enzyme Inhibition Constant Data from BindingDB
Found 3 hits for monomerid = 50153778
Trg + Lig
Ki
nM
ΔG°
kcal/mole
IC50
nM
Kd
nM
EC50/IC50
nM
koff
s-1
kon
M-1s-1
pHTemp
°C
Geranylgeranyl transferase type-1 subunit beta/Protein farnesyltransferase/geranylgeranyltransferase type-1 subunit alpha
(Bos taurus (bovine))
BDBM50153778
(6-((1-(4-cyano-3-(naphthalen-1-yl)benzyl)-1H-imida...)
Show SMILES N#Cc1ccc(OCc2cncn2Cc2ccc(C#N)c(c2)-c2cccc3ccccc23)nc1
Show InChI InChI=1S/C28H19N5O/c29-13-21-9-11-28(32-15-21)34-18-24-16-31-19-33(24)17-20-8-10-23(14-30)27(12-20)26-7-3-5-22-4-1-2-6-25(22)26/h1-12,15-16,19H,17-18H2
n/an/a 420n/an/an/an/an/an/a
Abbott Laboratories
Curated by ChEMBL
Assay Description
Inhibition of bovine Geranylgeranyltransferase
Bioorg Med Chem Lett 14: 5371-6 (2004)
Article DOI: 10.1016/j.bmcl.2004.08.011
BindingDB Entry DOI: 10.7270/Q2J102N8
Protein farnesyltransferase subunit beta/geranylgeranyltransferase type-1 subunit alpha
(Mus musculus)
BDBM50153778
(6-((1-(4-cyano-3-(naphthalen-1-yl)benzyl)-1H-imida...)
Show SMILES N#Cc1ccc(OCc2cncn2Cc2ccc(C#N)c(c2)-c2cccc3ccccc23)nc1
Show InChI InChI=1S/C28H19N5O/c29-13-21-9-11-28(32-15-21)34-18-24-16-31-19-33(24)17-20-8-10-23(14-30)27(12-20)26-7-3-5-22-4-1-2-6-25(22)26/h1-12,15-16,19H,17-18H2
n/an/an/an/a 60n/an/an/an/a
Abbott Laboratories
Curated by ChEMBL
Assay Description
Inhibition of H-Ras transformed NIH-3T3-cell proliferation
Bioorg Med Chem Lett 14: 5371-6 (2004)
Article DOI: 10.1016/j.bmcl.2004.08.011
BindingDB Entry DOI: 10.7270/Q2J102N8
Protein farnesyltransferase subunit beta/geranylgeranyltransferase type-1 subunit alpha
(Bos taurus (bovine))
BDBM50153778
(6-((1-(4-cyano-3-(naphthalen-1-yl)benzyl)-1H-imida...)
Show SMILES N#Cc1ccc(OCc2cncn2Cc2ccc(C#N)c(c2)-c2cccc3ccccc23)nc1
Show InChI InChI=1S/C28H19N5O/c29-13-21-9-11-28(32-15-21)34-18-24-16-31-19-33(24)17-20-8-10-23(14-30)27(12-20)26-7-3-5-22-4-1-2-6-25(22)26/h1-12,15-16,19H,17-18H2
n/an/a 0.900n/an/an/an/an/an/a
Abbott Laboratories
Curated by ChEMBL
Assay Description
Inhibition of bovine farnesyltransferase
Bioorg Med Chem Lett 14: 5371-6 (2004)
Article DOI: 10.1016/j.bmcl.2004.08.011
BindingDB Entry DOI: 10.7270/Q2J102N8