BDBM50153899 CHEMBL3775940
SMILES: COc1cc2ncnc(Nc3c(C)c(O)ccc3F)c2cc1OC
InChI Key: InChIKey=BVMMMLLTDUAVFA-UHFFFAOYSA-N
Data: 7 IC50
Activity Spreadsheet -- Enzyme Inhibition Constant Data from BindingDB
Found 7 hits for monomerid = 50153899
Trg + Lig
Ki
nM
ΔG°
kcal/mole
IC50
nM
Kd
nM
EC50/IC50
nM
koff
s-1
kon
M-1s-1
pHTemp
°C
Proto-oncogene tyrosine-protein kinase receptor Ret
(Homo sapiens (Human))
BDBM50153899
(CHEMBL3775940)
Show SMILES COc1cc2ncnc(Nc3c(C)c(O)ccc3F)c2cc1OC
Show InChI InChI=1S/C17H16FN3O3/c1-9-13(22)5-4-11(18)16(9)21-17-10-6-14(23-2)15(24-3)7-12(10)19-8-20-17/h4-8,22H,1-3H3,(H,19,20,21)
n/an/a 44n/an/an/an/an/an/a
University of Manchester
Curated by ChEMBL
Assay Description
Inhibition of human RET cytoplasmic domain (658 to 1114 residues) expressed in baculovirus system preincubated for 15 mins followed by substrate addi...
Eur J Med Chem 112: 20-32 (2016)
BindingDB Entry DOI: 10.7270/Q27W6F1V
Vascular endothelial growth factor receptor 2
(Homo sapiens (Human))
BDBM50153899
(CHEMBL3775940)
Show SMILES COc1cc2ncnc(Nc3c(C)c(O)ccc3F)c2cc1OC
Show InChI InChI=1S/C17H16FN3O3/c1-9-13(22)5-4-11(18)16(9)21-17-10-6-14(23-2)15(24-3)7-12(10)19-8-20-17/h4-8,22H,1-3H3,(H,19,20,21)
NCI pathway
Reactome pathway
n/an/a 5.70E+3n/an/an/an/an/an/a
University of Manchester
Curated by ChEMBL
Assay Description
Inhibition of recombinant His-tagged human KDR expressed in insect Sf21 cells preincubated for 15 mins followed by substrate addition measured after ...
Eur J Med Chem 112: 20-32 (2016)
BindingDB Entry DOI: 10.7270/Q27W6F1V
Kinesin-1 heavy chain/ Tyrosine-protein kinase receptor RET
(Homo sapiens (Human))
BDBM50153899
(CHEMBL3775940)
Show SMILES COc1cc2ncnc(Nc3c(C)c(O)ccc3F)c2cc1OC
Show InChI InChI=1S/C17H16FN3O3/c1-9-13(22)5-4-11(18)16(9)21-17-10-6-14(23-2)15(24-3)7-12(10)19-8-20-17/h4-8,22H,1-3H3,(H,19,20,21)
n/an/a 2.10E+3n/an/an/an/an/an/a
University of Manchester
Curated by ChEMBL
Assay Description
Inhibition of KIF5B/RET (unknown origin) expressed in mouse BA/F3 cells assessed as reduction in cell viability after 48 hrs by Cell titre glo-based ...
Eur J Med Chem 112: 20-32 (2016)
BindingDB Entry DOI: 10.7270/Q27W6F1V
Kinesin-1 heavy chain/ Tyrosine-protein kinase receptor RET
(Homo sapiens (Human))
BDBM50153899
(CHEMBL3775940)
Show SMILES COc1cc2ncnc(Nc3c(C)c(O)ccc3F)c2cc1OC
Show InChI InChI=1S/C17H16FN3O3/c1-9-13(22)5-4-11(18)16(9)21-17-10-6-14(23-2)15(24-3)7-12(10)19-8-20-17/h4-8,22H,1-3H3,(H,19,20,21)
n/an/a 2.10E+3n/an/an/an/an/an/a
University of Manchester
Curated by ChEMBL
Assay Description
Inhibition of recombinant KIF5B/RET (unknown origin) expressed in IL3 deficient BAF3 cells assessed as reduction in cell viability after 48 hrs by Ce...
Bioorg Med Chem Lett 26: 2724-9 (2016)
Article DOI: 10.1016/j.bmcl.2016.03.100
BindingDB Entry DOI: 10.7270/Q2WM1G93
Proto-oncogene tyrosine-protein kinase receptor Ret
(Homo sapiens (Human))
BDBM50153899
(CHEMBL3775940)
Show SMILES COc1cc2ncnc(Nc3c(C)c(O)ccc3F)c2cc1OC
Show InChI InChI=1S/C17H16FN3O3/c1-9-13(22)5-4-11(18)16(9)21-17-10-6-14(23-2)15(24-3)7-12(10)19-8-20-17/h4-8,22H,1-3H3,(H,19,20,21)
n/an/a 44n/an/an/an/an/an/a
University of Manchester
Curated by ChEMBL
Assay Description
Inhibition of N-terminal GST fused human RET (658 to 1114 amino acid residue) using CSKtide as substrate expressed in baculovirus preincubated for 15...
Bioorg Med Chem Lett 26: 2724-9 (2016)
Article DOI: 10.1016/j.bmcl.2016.03.100
BindingDB Entry DOI: 10.7270/Q2WM1G93
Vascular endothelial growth factor receptor 2
(Homo sapiens (Human))
BDBM50153899
(CHEMBL3775940)
Show SMILES COc1cc2ncnc(Nc3c(C)c(O)ccc3F)c2cc1OC
Show InChI InChI=1S/C17H16FN3O3/c1-9-13(22)5-4-11(18)16(9)21-17-10-6-14(23-2)15(24-3)7-12(10)19-8-20-17/h4-8,22H,1-3H3,(H,19,20,21)
NCI pathway
Reactome pathway
n/an/a>1.00E+4n/an/an/an/an/an/a
University of Manchester
Curated by ChEMBL
Assay Description
Inhibition of recombinant KDR (unknown origin) expressed in IL3 deficient BAF3 cells assessed as reduction in cell viability after 48 hrs by CellTite...
Bioorg Med Chem Lett 26: 2724-9 (2016)
Article DOI: 10.1016/j.bmcl.2016.03.100
BindingDB Entry DOI: 10.7270/Q2WM1G93
Vascular endothelial growth factor receptor 2
(Homo sapiens (Human))
BDBM50153899
(CHEMBL3775940)
Show SMILES COc1cc2ncnc(Nc3c(C)c(O)ccc3F)c2cc1OC
Show InChI InChI=1S/C17H16FN3O3/c1-9-13(22)5-4-11(18)16(9)21-17-10-6-14(23-2)15(24-3)7-12(10)19-8-20-17/h4-8,22H,1-3H3,(H,19,20,21)
NCI pathway
Reactome pathway
n/an/a>1.00E+4n/an/an/an/an/an/a
University of Manchester
Curated by ChEMBL
Assay Description
Inhibition of KDR (unknown origin) expressed in mouse BA/F3 cells assessed as reduction in cell viability after 48 hrs by Cell titre glo-based lumine...
Eur J Med Chem 112: 20-32 (2016)
BindingDB Entry DOI: 10.7270/Q27W6F1V