BDBM50153987 4-[2-(4-Fluoro-phenyl)-pyrazolo[1,5-b]pyridazin-3-yl]-benzenesulfonamide::CHEMBL366102
SMILES: NS(=O)(=O)c1ccc(cc1)-c1c(nn2ncccc12)-c1ccc(F)cc1
InChI Key: InChIKey=LRTMJWODQTZHNN-UHFFFAOYSA-N
Data: 2 IC50
Activity Spreadsheet -- Enzyme Inhibition Constant Data from BindingDB
Found 2 hits for monomerid = 50153987
Trg + Lig
Ki
nM
ΔG°
kcal/mole
IC50
nM
Kd
nM
EC50/IC50
nM
koff
s-1
kon
M-1s-1
pHTemp
°C
Prostaglandin G/H synthase 1
(Homo sapiens (Human))
BDBM50153987
(4-[2-(4-Fluoro-phenyl)-pyrazolo[1,5-b]pyridazin-3-...)
Show SMILES NS(=O)(=O)c1ccc(cc1)-c1c(nn2ncccc12)-c1ccc(F)cc1
Show InChI InChI=1S/C18H13FN4O2S/c19-14-7-3-13(4-8-14)18-17(16-2-1-11-21-23(16)22-18)12-5-9-15(10-6-12)26(20,24)25/h1-11H,(H2,20,24,25)
n/an/a 2.41E+4n/an/an/an/an/an/a
GlaxoSmithKline
Curated by ChEMBL
Assay Description
Inhibition of human cyclooxygenase-1 expressed in COS cells
Bioorg Med Chem Lett 14: 5445-8 (2004)
Article DOI: 10.1016/j.bmcl.2004.07.089
BindingDB Entry DOI: 10.7270/Q2RJ4HZ7
Prostaglandin G/H synthase 2
(Homo sapiens (Human))
BDBM50153987
(4-[2-(4-Fluoro-phenyl)-pyrazolo[1,5-b]pyridazin-3-...)
Show SMILES NS(=O)(=O)c1ccc(cc1)-c1c(nn2ncccc12)-c1ccc(F)cc1
Show InChI InChI=1S/C18H13FN4O2S/c19-14-7-3-13(4-8-14)18-17(16-2-1-11-21-23(16)22-18)12-5-9-15(10-6-12)26(20,24)25/h1-11H,(H2,20,24,25)
NCI pathway
Reactome pathway
n/an/a<10n/an/an/an/an/an/a
GlaxoSmithKline
Curated by ChEMBL
Assay Description
Inhibition of human cyclooxygenase-2 expressed in COS cells
Bioorg Med Chem Lett 14: 5445-8 (2004)
Article DOI: 10.1016/j.bmcl.2004.07.089
BindingDB Entry DOI: 10.7270/Q2RJ4HZ7