BDBM50154062 2-(5-HYDROXY-NAPHTHALEN-1-YL)-1,3-BENZOOXAZOL-6-OL::2-(5-Hydroxy-naphthalen-1-yl)-benzooxazol-6-ol::2-(5-hydroxynaphthalen-1-yl)benzo[d]oxazol-6-ol::CHEMBL185918
SMILES: Oc1ccc2nc(oc2c1)-c1cccc2c(O)cccc12
InChI Key: InChIKey=JHOZVRGNIYFYHE-UHFFFAOYSA-N
Data: 4 IC50
PDB links: 1 PDB ID matches this monomer.
Activity Spreadsheet -- Enzyme Inhibition Constant Data from BindingDB
Found 4 hits for monomerid = 50154062
Trg + Lig
Ki
nM
ΔG°
kcal/mole
IC50
nM
Kd
nM
EC50/IC50
nM
koff
s-1
kon
M-1s-1
pHTemp
°C
Estradiol receptor beta (ERβ)
(Homo sapiens (Human))
BDBM50154062
(2-(5-HYDROXY-NAPHTHALEN-1-YL)-1,3-BENZOOXAZOL-6-OL...)
Show SMILES Oc1ccc2nc(oc2c1)-c1cccc2c(O)cccc12
Show InChI InChI=1S/C17H11NO3/c19-10-7-8-14-16(9-10)21-17(18-14)13-5-1-4-12-11(13)3-2-6-15(12)20/h1-9,19-20H
n/an/a 5n/an/an/an/an/an/a
Wyeth Research
Curated by ChEMBL
Assay Description
Inhibitory concentration against human ER beta expressed in Escherichia coli was determined using [3H]17-beta-estradiol as radio ligand
J Med Chem 47: 5021-40 (2004)
Article DOI: 10.1021/jm049719y
BindingDB Entry DOI: 10.7270/Q2C828S5
3D
3D Structure (crystal)
Estradiol receptor beta (ERβ)
(Homo sapiens (Human))
BDBM50154062
(2-(5-HYDROXY-NAPHTHALEN-1-YL)-1,3-BENZOOXAZOL-6-OL...)
Show SMILES Oc1ccc2nc(oc2c1)-c1cccc2c(O)cccc12
Show InChI InChI=1S/C17H11NO3/c19-10-7-8-14-16(9-10)21-17(18-14)13-5-1-4-12-11(13)3-2-6-15(12)20/h1-9,19-20H
n/an/a 5n/an/an/an/an/an/a
Novartis Institutes for BioMedical Research
Curated by ChEMBL
Assay Description
Inhibition of estrogen receptor beta
J Med Chem 51: 2481-91 (2008)
Article DOI: 10.1021/jm701314u
BindingDB Entry DOI: 10.7270/Q2GX4CF5
3D
3D Structure (crystal)
Estradiol receptor beta (ERβ)
(Homo sapiens (Human))
BDBM50154062
(2-(5-HYDROXY-NAPHTHALEN-1-YL)-1,3-BENZOOXAZOL-6-OL...)
Show SMILES Oc1ccc2nc(oc2c1)-c1cccc2c(O)cccc12
Show InChI InChI=1S/C17H11NO3/c19-10-7-8-14-16(9-10)21-17(18-14)13-5-1-4-12-11(13)3-2-6-15(12)20/h1-9,19-20H
n/an/a 5n/an/an/an/an/an/a
Yantai University
Curated by ChEMBL
Assay Description
Binding affinity to ERbeta (unknown origin)
Eur J Med Chem 43: 43-52 (2008)
Article DOI: 10.1016/j.ejmech.2007.03.002
BindingDB Entry DOI: 10.7270/Q2WD40BT
3D
3D Structure (crystal)
Estrogen receptor
(Homo sapiens (Human))
BDBM50154062
(2-(5-HYDROXY-NAPHTHALEN-1-YL)-1,3-BENZOOXAZOL-6-OL...)
Show SMILES Oc1ccc2nc(oc2c1)-c1cccc2c(O)cccc12
Show InChI InChI=1S/C17H11NO3/c19-10-7-8-14-16(9-10)21-17(18-14)13-5-1-4-12-11(13)3-2-6-15(12)20/h1-9,19-20H
n/an/a 117n/an/an/an/an/an/a
Wyeth Research
Curated by ChEMBL
Assay Description
Inhibitory concentration against human ER alpha expressed in Escherichia coli was determined using [3H]17-beta-estradiol as radio ligand
J Med Chem 47: 5021-40 (2004)
Article DOI: 10.1021/jm049719y
BindingDB Entry DOI: 10.7270/Q2C828S5