BDBM50154294 CHEMBL3774647
SMILES: C\C(=C(\c1ccc(O)cc1)c1ccc(OCCN2CCCCC2)cc1)c1ccccc1
InChI Key: InChIKey=DQYOYKPEXFRMRE-XAYXJRQQSA-N
Data: 1 IC50
Activity Spreadsheet -- Enzyme Inhibition Constant Data from BindingDB
Found 1 hit for monomerid = 50154294
Trg + Lig
Ki
nM
ΔG°
kcal/mole
IC50
nM
Kd
nM
EC50/IC50
nM
koff
s-1
kon
M-1s-1
pHTemp
°C
Estrogen receptor
(Homo sapiens (Human))
BDBM50154294
(CHEMBL3774647)
Show SMILES C\C(=C(\c1ccc(O)cc1)c1ccc(OCCN2CCCCC2)cc1)c1ccccc1
Show InChI InChI=1S/C28H31NO2/c1-22(23-8-4-2-5-9-23)28(24-10-14-26(30)15-11-24)25-12-16-27(17-13-25)31-21-20-29-18-6-3-7-19-29/h2,4-5,8-17,30H,3,6-7,18-21H2,1H3/b28-22+
n/an/a 0.400n/an/an/an/an/an/a
German University in Cairo
Curated by ChEMBL
Assay Description
Displacement of [3H]-E2 from human ER-alpha incubated for 16 to 20 hrs by liquid scintillation counting analysis
Eur J Med Chem 112: 171-9 (2016)
BindingDB Entry DOI: 10.7270/Q2M61N49