BDBM50154637 CHEMBL3774919
SMILES: CCCCCn1cc(C(=O)NC23CC4CC(CC(C4)C2)C3)c(=O)n2nc(nc12)-c1ccc(C)cc1
InChI Key: InChIKey=WREPPILXFJFKRQ-UHFFFAOYSA-N
Data: 2 KI  1 IC50  1 EC50
Activity Spreadsheet -- Enzyme Inhibition Constant Data from BindingDB
Found 4 hits for monomerid = 50154637
Trg + Lig
Ki
nM
ΔG°
kcal/mole
IC50
nM
Kd
nM
EC50/IC50
nM
koff
s-1
kon
M-1s-1
pHTemp
°C
Cannabinoid receptor 2
(Homo sapiens (Human))
BDBM50154637
(CHEMBL3774919)
Show SMILES CCCCCn1cc(C(=O)NC23CC4CC(CC(C4)C2)C3)c(=O)n2nc(nc12)-c1ccc(C)cc1 |TLB:20:11:18:14.15.16,THB:16:15:12:18.17.19,16:17:14.15.20:12,10:11:18:14.15.16,20:15:18:11.12.19|
Show InChI InChI=1S/C28H35N5O2/c1-3-4-5-10-32-17-23(25(34)30-28-14-19-11-20(15-28)13-21(12-19)16-28)26(35)33-27(32)29-24(31-33)22-8-6-18(2)7-9-22/h6-9,17,19-21H,3-5,10-16H2,1-2H3,(H,30,34)
Reactome pathway
6.80n/an/an/an/an/an/an/an/a
Universit£ di Ferrara
Curated by ChEMBL
Assay Description
Displacement of [3H]CP-55,940 from human CB2 receptor expressed in CHO cell membranes after 60 mins by scintillation counting analysis
Eur J Med Chem 113: 11-27 (2016)
BindingDB Entry DOI: 10.7270/Q21J9CPC
Cannabinoid receptor 1
(Homo sapiens (Human))
BDBM50154637
(CHEMBL3774919)
Show SMILES CCCCCn1cc(C(=O)NC23CC4CC(CC(C4)C2)C3)c(=O)n2nc(nc12)-c1ccc(C)cc1 |TLB:20:11:18:14.15.16,THB:16:15:12:18.17.19,16:17:14.15.20:12,10:11:18:14.15.16,20:15:18:11.12.19|
Show InChI InChI=1S/C28H35N5O2/c1-3-4-5-10-32-17-23(25(34)30-28-14-19-11-20(15-28)13-21(12-19)16-28)26(35)33-27(32)29-24(31-33)22-8-6-18(2)7-9-22/h6-9,17,19-21H,3-5,10-16H2,1-2H3,(H,30,34)
NCI pathway
Reactome pathway
1.52E+3n/an/an/an/an/an/an/an/a
Universit£ di Ferrara
Curated by ChEMBL
Assay Description
Displacement of [3H]CP-55,940 from human CB1 receptor expressed in CHO cell membranes after 90 mins by scintillation counting analysis
Eur J Med Chem 113: 11-27 (2016)
BindingDB Entry DOI: 10.7270/Q21J9CPC
Cannabinoid receptor 2
(Homo sapiens (Human))
BDBM50154637
(CHEMBL3774919)
Show SMILES CCCCCn1cc(C(=O)NC23CC4CC(CC(C4)C2)C3)c(=O)n2nc(nc12)-c1ccc(C)cc1 |TLB:20:11:18:14.15.16,THB:16:15:12:18.17.19,16:17:14.15.20:12,10:11:18:14.15.16,20:15:18:11.12.19|
Show InChI InChI=1S/C28H35N5O2/c1-3-4-5-10-32-17-23(25(34)30-28-14-19-11-20(15-28)13-21(12-19)16-28)26(35)33-27(32)29-24(31-33)22-8-6-18(2)7-9-22/h6-9,17,19-21H,3-5,10-16H2,1-2H3,(H,30,34)
Reactome pathway
n/an/a 13n/an/an/an/an/an/a
Universit£ di Ferrara
Curated by ChEMBL
Assay Description
Antagonist activity at human CB2 receptor transfected in CHO cells assessed as inhibition of WIN 55,212-2 mediated suppression of forksolin induced c...
Eur J Med Chem 113: 11-27 (2016)
BindingDB Entry DOI: 10.7270/Q21J9CPC
Cannabinoid receptor 2
(Homo sapiens (Human))
BDBM50154637
(CHEMBL3774919)
Show SMILES CCCCCn1cc(C(=O)NC23CC4CC(CC(C4)C2)C3)c(=O)n2nc(nc12)-c1ccc(C)cc1 |TLB:20:11:18:14.15.16,THB:16:15:12:18.17.19,16:17:14.15.20:12,10:11:18:14.15.16,20:15:18:11.12.19|
Show InChI InChI=1S/C28H35N5O2/c1-3-4-5-10-32-17-23(25(34)30-28-14-19-11-20(15-28)13-21(12-19)16-28)26(35)33-27(32)29-24(31-33)22-8-6-18(2)7-9-22/h6-9,17,19-21H,3-5,10-16H2,1-2H3,(H,30,34)
Reactome pathway
n/an/an/an/a 652n/an/an/an/a
Universit£ di Ferrara
Curated by ChEMBL
Assay Description
Inverse agonist activity at human CB2 receptor transfected in CHO cells assessed as increase in forksolin stimulated cAMP production by scintillation...
Eur J Med Chem 113: 11-27 (2016)
BindingDB Entry DOI: 10.7270/Q21J9CPC