BDBM50154826 CHEMBL3774740
SMILES: Cc1c(nnn1-c1ccc(F)c(Cl)c1)C(=O)Nc1ccc(Oc2ccnc3[nH]ccc23)cc1
InChI Key: InChIKey=ACJIAFNNEWUNMU-UHFFFAOYSA-N
Data: 1 IC50
Activity Spreadsheet -- Enzyme Inhibition Constant Data from BindingDB
Found 1 hit for monomerid = 50154826
Trg + Lig
Ki
nM
ΔG°
kcal/mole
IC50
nM
Kd
nM
EC50/IC50
nM
koff
s-1
kon
M-1s-1
pHTemp
°C
Hepatocyte growth factor receptor
(Homo sapiens (Human))
BDBM50154826
(CHEMBL3774740)
Show SMILES Cc1c(nnn1-c1ccc(F)c(Cl)c1)C(=O)Nc1ccc(Oc2ccnc3[nH]ccc23)cc1
Show InChI InChI=1S/C23H16ClFN6O2/c1-13-21(29-30-31(13)15-4-7-19(25)18(24)12-15)23(32)28-14-2-5-16(6-3-14)33-20-9-11-27-22-17(20)8-10-26-22/h2-12H,1H3,(H,26,27)(H,28,32)
n/an/a 22n/an/an/an/an/an/a
Jiangxi Science and Technology Normal University
Curated by ChEMBL
Assay Description
Inhibition of cMet (unknown origin) using poly (Glu, Tyr) 4:1 as substrate after 30 mins by HTRF assay
Bioorg Med Chem Lett 26: 1680-4 (2016)
BindingDB Entry DOI: 10.7270/Q2FF3V7R