BDBM50154831 CHEMBL3775550
SMILES: Cc1c(nnn1-c1ccccc1)C(=O)Nc1ccc(Oc2ccnc3[nH]ccc23)cc1
InChI Key: InChIKey=WHAYQOVMFDMZRW-UHFFFAOYSA-N
Data: 1 IC50
Activity Spreadsheet -- Enzyme Inhibition Constant Data from BindingDB
Found 1 hit for monomerid = 50154831
Trg + Lig
Ki
nM
ΔG°
kcal/mole
IC50
nM
Kd
nM
EC50/IC50
nM
koff
s-1
kon
M-1s-1
pHTemp
°C
Hepatocyte growth factor receptor
(Homo sapiens (Human))
BDBM50154831
(CHEMBL3775550)
Show SMILES Cc1c(nnn1-c1ccccc1)C(=O)Nc1ccc(Oc2ccnc3[nH]ccc23)cc1
Show InChI InChI=1S/C23H18N6O2/c1-15-21(27-28-29(15)17-5-3-2-4-6-17)23(30)26-16-7-9-18(10-8-16)31-20-12-14-25-22-19(20)11-13-24-22/h2-14H,1H3,(H,24,25)(H,26,30)
n/an/a 19n/an/an/an/an/an/a
Jiangxi Science and Technology Normal University
Curated by ChEMBL
Assay Description
Inhibition of cMet (unknown origin) using poly (Glu, Tyr) 4:1 as substrate after 30 mins by HTRF assay
Bioorg Med Chem Lett 26: 1680-4 (2016)
BindingDB Entry DOI: 10.7270/Q2FF3V7R