BDBM50154832 CHEMBL3775150
SMILES: Cc1c(nnn1-c1ccc(Cl)c(c1)C(F)(F)F)C(=O)Nc1ccc(Oc2ccnc3[nH]ccc23)c(F)c1
InChI Key: InChIKey=ADPAHMAXGLEZMX-UHFFFAOYSA-N
Data: 1 IC50
Activity Spreadsheet -- Enzyme Inhibition Constant Data from BindingDB
Found 1 hit for monomerid = 50154832
Trg + Lig
Ki
nM
ΔG°
kcal/mole
IC50
nM
Kd
nM
EC50/IC50
nM
koff
s-1
kon
M-1s-1
pHTemp
°C
Hepatocyte growth factor receptor
(Homo sapiens (Human))
BDBM50154832
(CHEMBL3775150)
Show SMILES Cc1c(nnn1-c1ccc(Cl)c(c1)C(F)(F)F)C(=O)Nc1ccc(Oc2ccnc3[nH]ccc23)c(F)c1
Show InChI InChI=1S/C24H15ClF4N6O2/c1-12-21(33-34-35(12)14-3-4-17(25)16(11-14)24(27,28)29)23(36)32-13-2-5-20(18(26)10-13)37-19-7-9-31-22-15(19)6-8-30-22/h2-11H,1H3,(H,30,31)(H,32,36)
n/an/a 38n/an/an/an/an/an/a
Jiangxi Science and Technology Normal University
Curated by ChEMBL
Assay Description
Inhibition of cMet (unknown origin) using poly (Glu, Tyr) 4:1 as substrate after 30 mins by HTRF assay
Bioorg Med Chem Lett 26: 1680-4 (2016)
BindingDB Entry DOI: 10.7270/Q2FF3V7R