BDBM50154917 CHEMBL3775861
SMILES: CC(C)c1n[nH]c2c(NCc3ccc(cc3)-c3ccccn3)nc(NCc3ccc(cc3)-c3ccccn3)nc12
InChI Key: InChIKey=XUSMVZTWOJTGSM-UHFFFAOYSA-N
Data: 2 IC50
Activity Spreadsheet -- Enzyme Inhibition Constant Data from BindingDB
Found 2 hits for monomerid = 50154917
Trg + Lig
Ki
nM
ΔG°
kcal/mole
IC50
nM
Kd
nM
EC50/IC50
nM
koff
s-1
kon
M-1s-1
pHTemp
°C
CDK2/CycE
(Homo sapiens (Human))
BDBM50154917
(CHEMBL3775861)
Show SMILES CC(C)c1n[nH]c2c(NCc3ccc(cc3)-c3ccccn3)nc(NCc3ccc(cc3)-c3ccccn3)nc12
Show InChI InChI=1S/C32H30N8/c1-21(2)28-29-30(40-39-28)31(35-19-22-9-13-24(14-10-22)26-7-3-5-17-33-26)38-32(37-29)36-20-23-11-15-25(16-12-23)27-8-4-6-18-34-27/h3-18,21H,19-20H2,1-2H3,(H,39,40)(H2,35,36,37,38)
n/an/a 1.45E+3n/an/an/an/an/an/a
Palack£ University and Institute of Experimental Botany AS CR
Curated by ChEMBL
Assay Description
Inhibition of CDK2/Cyclin E (unknown origin) expressed in sf9 cells using histone H1 as substrate in presence of [gamma33P]-ATP
Eur J Med Chem 110: 291-301 (2016)
BindingDB Entry DOI: 10.7270/Q2SQ927C
Cyclin-dependent-like kinase 5
(Homo sapiens (Human))
BDBM50154917
(CHEMBL3775861)
Show SMILES CC(C)c1n[nH]c2c(NCc3ccc(cc3)-c3ccccn3)nc(NCc3ccc(cc3)-c3ccccn3)nc12
Show InChI InChI=1S/C32H30N8/c1-21(2)28-29-30(40-39-28)31(35-19-22-9-13-24(14-10-22)26-7-3-5-17-33-26)38-32(37-29)36-20-23-11-15-25(16-12-23)27-8-4-6-18-34-27/h3-18,21H,19-20H2,1-2H3,(H,39,40)(H2,35,36,37,38)
NCI pathway
Reactome pathway
n/an/a 3.60E+3n/an/an/an/an/an/a
Palack£ University and Institute of Experimental Botany AS CR
Curated by ChEMBL
Assay Description
Inhibition of CDK5 (unknown origin) using histone H1 as substrate in presence of [gamma33P]-ATP
Eur J Med Chem 110: 291-301 (2016)
BindingDB Entry DOI: 10.7270/Q2SQ927C