BDBM50154923 CHEMBL3775608
SMILES: CC(C)c1n[nH]c2c(NCc3ccc(cc3)-c3ccccn3)nc(NCC(N)CO)nc12
InChI Key: InChIKey=JZBRRQXXXSBXIS-UHFFFAOYSA-N
Data: 2 IC50
Activity Spreadsheet -- Enzyme Inhibition Constant Data from BindingDB
Found 2 hits for monomerid = 50154923
Trg + Lig
Ki
nM
ΔG°
kcal/mole
IC50
nM
Kd
nM
EC50/IC50
nM
koff
s-1
kon
M-1s-1
pHTemp
°C
CDK2/CycE
(Homo sapiens (Human))
BDBM50154923
(CHEMBL3775608)
Show SMILES CC(C)c1n[nH]c2c(NCc3ccc(cc3)-c3ccccn3)nc(NCC(N)CO)nc12
Show InChI InChI=1S/C23H28N8O/c1-14(2)19-20-21(31-30-19)22(29-23(28-20)27-12-17(24)13-32)26-11-15-6-8-16(9-7-15)18-5-3-4-10-25-18/h3-10,14,17,32H,11-13,24H2,1-2H3,(H,30,31)(H2,26,27,28,29)
n/an/a 51n/an/an/an/an/an/a
Palack£ University and Institute of Experimental Botany AS CR
Curated by ChEMBL
Assay Description
Inhibition of CDK2/Cyclin E (unknown origin) expressed in sf9 cells using histone H1 as substrate in presence of [gamma33P]-ATP
Eur J Med Chem 110: 291-301 (2016)
BindingDB Entry DOI: 10.7270/Q2SQ927C
Cyclin-dependent-like kinase 5
(Homo sapiens (Human))
BDBM50154923
(CHEMBL3775608)
Show SMILES CC(C)c1n[nH]c2c(NCc3ccc(cc3)-c3ccccn3)nc(NCC(N)CO)nc12
Show InChI InChI=1S/C23H28N8O/c1-14(2)19-20-21(31-30-19)22(29-23(28-20)27-12-17(24)13-32)26-11-15-6-8-16(9-7-15)18-5-3-4-10-25-18/h3-10,14,17,32H,11-13,24H2,1-2H3,(H,30,31)(H2,26,27,28,29)
NCI pathway
Reactome pathway
n/an/a 17n/an/an/an/an/an/a
Palack£ University and Institute of Experimental Botany AS CR
Curated by ChEMBL
Assay Description
Inhibition of CDK5 (unknown origin) using histone H1 as substrate in presence of [gamma33P]-ATP
Eur J Med Chem 110: 291-301 (2016)
BindingDB Entry DOI: 10.7270/Q2SQ927C