BDBM50155230 CHEMBL187903::N-(5-Cyclobutyl-thiazol-2-yl)-2-(5,6-dimethyl-benzoimidazol-1-yl)-acetamide
SMILES: Cc1cc2ncn(CC(=O)Nc3ncc(s3)C3CCC3)c2cc1C
InChI Key: InChIKey=BBSYDDJGTACDNC-UHFFFAOYSA-N
Data: 2 IC50
Activity Spreadsheet -- Enzyme Inhibition Constant Data from BindingDB
Found 2 hits for monomerid = 50155230
Trg + Lig
Ki
nM
ΔG°
kcal/mole
IC50
nM
Kd
nM
EC50/IC50
nM
koff
s-1
kon
M-1s-1
pHTemp
°C
Cyclin-dependent-like kinase 5
(Homo sapiens (Human))
BDBM50155230
(CHEMBL187903 | N-(5-Cyclobutyl-thiazol-2-yl)-2-(5,...)
Show SMILES Cc1cc2ncn(CC(=O)Nc3ncc(s3)C3CCC3)c2cc1C
Show InChI InChI=1S/C18H20N4OS/c1-11-6-14-15(7-12(11)2)22(10-20-14)9-17(23)21-18-19-8-16(24-18)13-4-3-5-13/h6-8,10,13H,3-5,9H2,1-2H3,(H,19,21,23)
NCI pathway
Reactome pathway
n/an/a 13n/an/an/an/an/an/a
Pfizer Global Research and Development
Curated by ChEMBL
Assay Description
Concentration required for inhibition of cyclin-dependent kinase 5 was measured by scintillation proximity assay
Bioorg Med Chem Lett 14: 5521-5 (2004)
Article DOI: 10.1016/j.bmcl.2004.09.006
BindingDB Entry DOI: 10.7270/Q2D50MFB
CDK2/CycE
(Homo sapiens (Human))
BDBM50155230
(CHEMBL187903 | N-(5-Cyclobutyl-thiazol-2-yl)-2-(5,...)
Show SMILES Cc1cc2ncn(CC(=O)Nc3ncc(s3)C3CCC3)c2cc1C
Show InChI InChI=1S/C18H20N4OS/c1-11-6-14-15(7-12(11)2)22(10-20-14)9-17(23)21-18-19-8-16(24-18)13-4-3-5-13/h6-8,10,13H,3-5,9H2,1-2H3,(H,19,21,23)
n/an/a 26n/an/an/an/an/an/a
Pfizer Global Research and Development
Curated by ChEMBL
Assay Description
Concentration required for inhibition of cyclin dependant kinase 2-cyclin E was measured by scintillation proximity assay
Bioorg Med Chem Lett 14: 5521-5 (2004)
Article DOI: 10.1016/j.bmcl.2004.09.006
BindingDB Entry DOI: 10.7270/Q2D50MFB