null
SMILES: Cc1cc(cc(C)c1C)-c1c(OCC[C@@H]2CCCCN2)c2cc(C(=O)Nc3cnsn3)c(Cl)cc2[nH]c1=O
InChI Key: InChIKey=BEDCPQWYYPUQGP-IBGZPJMESA-N
Activity Spreadsheet -- Enzyme Inhibition Constant Data from BindingDB
Found 2 hits for monomerid = 50155361
Trg + Lig
Ki
nM
ΔG°
kcal/mole
IC50
nM
Kd
nM
EC50/IC50
nM
koff
s-1
kon
M-1s-1
pHTemp
°C
Gonadotropin-releasing hormone receptor
(Homo sapiens (Human))
BDBM50155361
(7-Chloro-2-oxo-4-(2-piperidin-2-yl-ethoxy)-3-((S)-...)
Show SMILES Cc1cc(cc(C)c1C)-c1c(OCC[C@@H]2CCCCN2)c2cc(C(=O)Nc3cnsn3)c(Cl)cc2[nH]c1=O
Show InChI InChI=1S/C28H30ClN5O3S/c1-15-10-18(11-16(2)17(15)3)25-26(37-9-7-19-6-4-5-8-30-19)21-12-20(22(29)13-23(21)32-28(25)36)27(35)33-24-14-31-38-34-24/h10-14,19,30H,4-9H2,1-3H3,(H,32,36)(H,33,34,35)/t19-/m0/s1
n/an/a 1.60n/an/an/an/an/an/a
Merck Research Laboratories
Curated by ChEMBL
Assay Description
Inhibition of GnRH-stimulated phosphatidyl inositol hydrolysis in CHO cells expressing GnRH receptor
Bioorg Med Chem Lett 14: 5599-603 (2004)
Article DOI: 10.1016/j.bmcl.2004.08.056
BindingDB Entry DOI: 10.7270/Q20V8C8D
Gonadotropin-releasing hormone receptor
(Homo sapiens (Human))
BDBM50155361
(7-Chloro-2-oxo-4-(2-piperidin-2-yl-ethoxy)-3-((S)-...)
Show SMILES Cc1cc(cc(C)c1C)-c1c(OCC[C@@H]2CCCCN2)c2cc(C(=O)Nc3cnsn3)c(Cl)cc2[nH]c1=O
Show InChI InChI=1S/C28H30ClN5O3S/c1-15-10-18(11-16(2)17(15)3)25-26(37-9-7-19-6-4-5-8-30-19)21-12-20(22(29)13-23(21)32-28(25)36)27(35)33-24-14-31-38-34-24/h10-14,19,30H,4-9H2,1-3H3,(H,32,36)(H,33,34,35)/t19-/m0/s1
n/an/a 0.550n/an/an/an/an/an/a
Merck Research Laboratories
Curated by ChEMBL
Assay Description
Binding affinity towards human gonadotropin releasing hormone receptor expressed in CHO cells was determined by using [125I]-buserelin as radioligand
Bioorg Med Chem Lett 14: 5599-603 (2004)
Article DOI: 10.1016/j.bmcl.2004.08.056
BindingDB Entry DOI: 10.7270/Q20V8C8D