BDBM50155507 CHEMBL3780904
SMILES: C[C@@H](N1CC[C@@H](CNCc2cc(ccn2)C(O)=O)C1=O)c1ccccc1
InChI Key: InChIKey=PBHPFRYXXULYJJ-PBHICJAKSA-N
Data: 5 IC50
Activity Spreadsheet -- Enzyme Inhibition Constant Data from BindingDB
Found 5 hits for monomerid = 50155507
Trg + Lig
Ki
nM
ΔG°
kcal/mole
IC50
nM
Kd
nM
EC50/IC50
nM
koff
s-1
kon
M-1s-1
pHTemp
°C
Lysine-specific demethylase 6A (KDM6A)
(Homo sapiens (Human))
BDBM50155507
(CHEMBL3780904)
Show SMILES C[C@@H](N1CC[C@@H](CNCc2cc(ccn2)C(O)=O)C1=O)c1ccccc1 |r|
Show InChI InChI=1S/C20H23N3O3/c1-14(15-5-3-2-4-6-15)23-10-8-17(19(23)24)12-21-13-18-11-16(20(25)26)7-9-22-18/h2-7,9,11,14,17,21H,8,10,12-13H2,1H3,(H,25,26)/t14-,17+/m1/s1
n/an/a>2.50E+3n/an/an/an/an/an/a
Therachem Research Medilab (India) Pvt. Ltd.
Curated by ChEMBL
Assay Description
Inhibition of human KDM6A preincubated for 10 mins followed by substrate addition by AlphaLISA assay
ACS Med Chem Lett 7: 128-30 (2016)
BindingDB Entry DOI: 10.7270/Q2CJ8GC9
Histone lysine demethylase PHF8
(Homo sapiens (Human))
BDBM50155507
(CHEMBL3780904)
Show SMILES C[C@@H](N1CC[C@@H](CNCc2cc(ccn2)C(O)=O)C1=O)c1ccccc1 |r|
Show InChI InChI=1S/C20H23N3O3/c1-14(15-5-3-2-4-6-15)23-10-8-17(19(23)24)12-21-13-18-11-16(20(25)26)7-9-22-18/h2-7,9,11,14,17,21H,8,10,12-13H2,1H3,(H,25,26)/t14-,17+/m1/s1
n/an/a<250n/an/an/an/an/an/a
Therachem Research Medilab (India) Pvt. Ltd.
Curated by ChEMBL
Assay Description
Inhibition of human PHF8 preincubated for 10 mins followed by substrate addition by AlphaLISA assay
ACS Med Chem Lett 7: 128-30 (2016)
BindingDB Entry DOI: 10.7270/Q2CJ8GC9
Lysine-specific demethylase 5B
(Homo sapiens (Human))
BDBM50155507
(CHEMBL3780904)
Show SMILES C[C@@H](N1CC[C@@H](CNCc2cc(ccn2)C(O)=O)C1=O)c1ccccc1 |r|
Show InChI InChI=1S/C20H23N3O3/c1-14(15-5-3-2-4-6-15)23-10-8-17(19(23)24)12-21-13-18-11-16(20(25)26)7-9-22-18/h2-7,9,11,14,17,21H,8,10,12-13H2,1H3,(H,25,26)/t14-,17+/m1/s1
n/an/a<250n/an/an/an/an/an/a
Therachem Research Medilab (India) Pvt. Ltd.
Curated by ChEMBL
Assay Description
Inhibition of human KDM5B preincubated for 10 mins followed by substrate addition by AlphaLISA assay
ACS Med Chem Lett 7: 128-30 (2016)
BindingDB Entry DOI: 10.7270/Q2CJ8GC9
Lysine-specific demethylase 4C
(Homo sapiens (Human))
BDBM50155507
(CHEMBL3780904)
Show SMILES C[C@@H](N1CC[C@@H](CNCc2cc(ccn2)C(O)=O)C1=O)c1ccccc1 |r|
Show InChI InChI=1S/C20H23N3O3/c1-14(15-5-3-2-4-6-15)23-10-8-17(19(23)24)12-21-13-18-11-16(20(25)26)7-9-22-18/h2-7,9,11,14,17,21H,8,10,12-13H2,1H3,(H,25,26)/t14-,17+/m1/s1
n/an/a<250n/an/an/an/an/an/a
Therachem Research Medilab (India) Pvt. Ltd.
Curated by ChEMBL
Assay Description
Inhibition of human KDM4C preincubated for 10 mins followed by substrate addition by AlphaLISA assay
ACS Med Chem Lett 7: 128-30 (2016)
BindingDB Entry DOI: 10.7270/Q2CJ8GC9
Lysine-specific demethylase 2B
(Homo sapiens (Human))
BDBM50155507
(CHEMBL3780904)
Show SMILES C[C@@H](N1CC[C@@H](CNCc2cc(ccn2)C(O)=O)C1=O)c1ccccc1 |r|
Show InChI InChI=1S/C20H23N3O3/c1-14(15-5-3-2-4-6-15)23-10-8-17(19(23)24)12-21-13-18-11-16(20(25)26)7-9-22-18/h2-7,9,11,14,17,21H,8,10,12-13H2,1H3,(H,25,26)/t14-,17+/m1/s1
n/an/a<250n/an/an/an/an/an/a
Therachem Research Medilab (India) Pvt. Ltd.
Curated by ChEMBL
Assay Description
Inhibition of human KDM2B preincubated for 10 mins followed by substrate addition by AlphaLISA assay
ACS Med Chem Lett 7: 128-30 (2016)
BindingDB Entry DOI: 10.7270/Q2CJ8GC9