null
SMILES: COc1ccccc1N1CCN(CC1)c1ncnc2n(ncc12)-c1ccc(C)cc1
InChI Key: InChIKey=AQYMZJOADURYRZ-UHFFFAOYSA-N
Activity Spreadsheet -- Enzyme Inhibition Constant Data from BindingDB
Found 3 hits for monomerid = 50155584
Trg + Lig
Ki
nM
ΔG°
kcal/mole
IC50
nM
Kd
nM
EC50/IC50
nM
koff
s-1
kon
M-1s-1
pHTemp
°C
Solute carrier family 2, facilitated glucose transporter member 1
(Homo sapiens (Human))
BDBM50155584
(CHEMBL1551510)
Show SMILES COc1ccccc1N1CCN(CC1)c1ncnc2n(ncc12)-c1ccc(C)cc1
Show InChI InChI=1S/C23H24N6O/c1-17-7-9-18(10-8-17)29-23-19(15-26-29)22(24-16-25-23)28-13-11-27(12-14-28)20-5-3-4-6-21(20)30-2/h3-10,15-16H,11-14H2,1-2H3
n/an/a 1.50E+3n/an/an/an/an/an/a
Bayer Pharma AG
Curated by ChEMBL
Assay Description
Inhibition of human GLUT1 expressed in DLD1 cells assessed as ATP production co-incubated with 100 mM glucose for 16 hrs by CellTiter-Glo assay in pr...
Bioorg Med Chem Lett 26: 1732-7 (2016)
BindingDB Entry DOI: 10.7270/Q2639RM3
Solute carrier family 2, facilitated glucose transporter member 2
(Homo sapiens (Human))
BDBM50155584
(CHEMBL1551510)
Show SMILES COc1ccccc1N1CCN(CC1)c1ncnc2n(ncc12)-c1ccc(C)cc1
Show InChI InChI=1S/C23H24N6O/c1-17-7-9-18(10-8-17)29-23-19(15-26-29)22(24-16-25-23)28-13-11-27(12-14-28)20-5-3-4-6-21(20)30-2/h3-10,15-16H,11-14H2,1-2H3
NCI pathway
Reactome pathway
n/an/a 1.00E+4n/an/an/an/an/an/a
Bayer Pharma AG
Curated by ChEMBL
Assay Description
Inhibition of human GLUT2 expressed in CHO cells assessed as ATP production co-incubated with 30 mM fructose for 16 hrs by CellTiter-Glo assay in pre...
Bioorg Med Chem Lett 26: 1732-7 (2016)
BindingDB Entry DOI: 10.7270/Q2639RM3
Solute carrier family 2, facilitated glucose transporter member 3
(Homo sapiens (Human))
BDBM50155584
(CHEMBL1551510)
Show SMILES COc1ccccc1N1CCN(CC1)c1ncnc2n(ncc12)-c1ccc(C)cc1
Show InChI InChI=1S/C23H24N6O/c1-17-7-9-18(10-8-17)29-23-19(15-26-29)22(24-16-25-23)28-13-11-27(12-14-28)20-5-3-4-6-21(20)30-2/h3-10,15-16H,11-14H2,1-2H3
n/an/a 3.00E+3n/an/an/an/an/an/a
Bayer Pharma AG
Curated by ChEMBL
Assay Description
Inhibition of human GLUT3 expressed in GLUT1 knock-out DLD1 cells assessed as ATP production co-incubated with 300 mM glucose for 16 hrs by CellTiter...
Bioorg Med Chem Lett 26: 1732-7 (2016)
BindingDB Entry DOI: 10.7270/Q2639RM3