BDBM50155672 CHEMBL3781183
SMILES: COc1cc(ccc1N1CCN(CC1)c1ncnc2n(ncc12)-c1ccccc1)C#N
InChI Key: InChIKey=VVWQJWNUSDWPGZ-UHFFFAOYSA-N
Data: 3 IC50
Activity Spreadsheet -- Enzyme Inhibition Constant Data from BindingDB
Found 3 hits for monomerid = 50155672
Trg + Lig
Ki
nM
ΔG°
kcal/mole
IC50
nM
Kd
nM
EC50/IC50
nM
koff
s-1
kon
M-1s-1
pHTemp
°C
Solute carrier family 2, facilitated glucose transporter member 3
(Homo sapiens (Human))
BDBM50155672
(CHEMBL3781183)
Show SMILES COc1cc(ccc1N1CCN(CC1)c1ncnc2n(ncc12)-c1ccccc1)C#N
Show InChI InChI=1S/C23H21N7O/c1-31-21-13-17(14-24)7-8-20(21)28-9-11-29(12-10-28)22-19-15-27-30(23(19)26-16-25-22)18-5-3-2-4-6-18/h2-8,13,15-16H,9-12H2,1H3
n/an/a 170n/an/an/an/an/an/a
Bayer Pharma AG
Curated by ChEMBL
Assay Description
Inhibition of human GLUT3 expressed in GLUT1 knock-out DLD1 cells assessed as ATP production co-incubated with 300 mM glucose for 16 hrs by CellTiter...
Bioorg Med Chem Lett 26: 1732-7 (2016)
BindingDB Entry DOI: 10.7270/Q2639RM3
Glucose transporter
(Homo sapiens (Human))
BDBM50155672
(CHEMBL3781183)
Show SMILES COc1cc(ccc1N1CCN(CC1)c1ncnc2n(ncc12)-c1ccccc1)C#N
Show InChI InChI=1S/C23H21N7O/c1-31-21-13-17(14-24)7-8-20(21)28-9-11-29(12-10-28)22-19-15-27-30(23(19)26-16-25-22)18-5-3-2-4-6-18/h2-8,13,15-16H,9-12H2,1H3
n/an/a 150n/an/an/an/an/an/a
Bayer Pharma AG
Curated by ChEMBL
Assay Description
Inhibition of human GLUT1 expressed in DLD1 cells assessed as ATP production co-incubated with 100 mM glucose for 16 hrs by CellTiter-Glo assay in pr...
Bioorg Med Chem Lett 26: 1732-7 (2016)
BindingDB Entry DOI: 10.7270/Q2639RM3
Solute carrier family 2, facilitated glucose transporter member 2
(Homo sapiens (Human))
BDBM50155672
(CHEMBL3781183)
Show SMILES COc1cc(ccc1N1CCN(CC1)c1ncnc2n(ncc12)-c1ccccc1)C#N
Show InChI InChI=1S/C23H21N7O/c1-31-21-13-17(14-24)7-8-20(21)28-9-11-29(12-10-28)22-19-15-27-30(23(19)26-16-25-22)18-5-3-2-4-6-18/h2-8,13,15-16H,9-12H2,1H3
NCI pathway
Reactome pathway
n/an/a 1.70E+3n/an/an/an/an/an/a
Bayer Pharma AG
Curated by ChEMBL
Assay Description
Inhibition of human GLUT2 expressed in CHO cells assessed as ATP production co-incubated with 30 mM fructose for 16 hrs by CellTiter-Glo assay in pre...
Bioorg Med Chem Lett 26: 1732-7 (2016)
BindingDB Entry DOI: 10.7270/Q2639RM3