null
SMILES: CC(C)CC(=O)c1ccc(OCCCCSc2ccncc2)c(C)c1O
InChI Key: InChIKey=BBMHENISQZYUSJ-UHFFFAOYSA-N
Activity Spreadsheet -- Enzyme Inhibition Constant Data from BindingDB
Found 1 hit for monomerid = 50155701
Trg + Lig
Ki
nM
ΔG°
kcal/mole
IC50
nM
Kd
nM
EC50/IC50
nM
koff
s-1
kon
M-1s-1
pHTemp
°C
Metabotropic glutamate receptor 2
(Homo sapiens (Human))
BDBM50155701
(1-{2-Hydroxy-3-methyl-4-[4-(pyridin-4-ylsulfanyl)-...)
Show SMILES CC(C)CC(=O)c1ccc(OCCCCSc2ccncc2)c(C)c1O
Show InChI InChI=1S/C21H27NO3S/c1-15(2)14-19(23)18-6-7-20(16(3)21(18)24)25-12-4-5-13-26-17-8-10-22-11-9-17/h6-11,15,24H,4-5,12-14H2,1-3H3
n/an/an/an/a 340n/an/an/an/a
Merck Research Laboratories
Curated by ChEMBL
Assay Description
Binding affinity towards human metabotropic glutamate receptor 2 determined by [35S]-GTP gama S binding assay
Bioorg Med Chem Lett 14: 5867-72 (2004)
Article DOI: 10.1016/j.bmcl.2004.09.028
BindingDB Entry DOI: 10.7270/Q2XW4J94