BDBM50155770 CHEMBL3781885
SMILES: Cl.N[C@@H]1C[C@H]1c1ccc(NC(=O)c2ccc(NC(=O)OCc3ccccc3)c(c2)N2CCOCC2)cc1
InChI Key: InChIKey=HVQAVRGTDVWKEI-KZDWWKKTSA-N
Data: 4 IC50
Activity Spreadsheet -- Enzyme Inhibition Constant Data from BindingDB
Found 4 hits for monomerid = 50155770
Trg + Lig
Ki
nM
ΔG°
kcal/mole
IC50
nM
Kd
nM
EC50/IC50
nM
koff
s-1
kon
M-1s-1
pHTemp
°C
REST corepressor 1
(Homo sapiens (Human))
BDBM50155770
(CHEMBL3781885)
Show SMILES Cl.N[C@@H]1C[C@H]1c1ccc(NC(=O)c2ccc(NC(=O)OCc3ccccc3)c(c2)N2CCOCC2)cc1 |r|
Show InChI InChI=1S/C28H30N4O4.ClH/c29-24-17-23(24)20-6-9-22(10-7-20)30-27(33)21-8-11-25(26(16-21)32-12-14-35-15-13-32)31-28(34)36-18-19-4-2-1-3-5-19;/h1-11,16,23-24H,12-15,17-18,29H2,(H,30,33)(H,31,34);1H/t23-,24+;/m0./s1
Reactome pathway
n/an/a 75n/an/an/an/an/an/a
European Institute of Oncology
Curated by ChEMBL
Assay Description
Inhibition of human recombinant KDM1A/CoREST expressed in Escherichia coli using mono-methylated H3-K4 peptide as substrate assessed as H2O2 release ...
J Med Chem 59: 1501-17 (2016)
BindingDB Entry DOI: 10.7270/Q2086767
Amine oxidase (flavin-containing) A
(Homo sapiens (Human))
BDBM50155770
(CHEMBL3781885)
Show SMILES Cl.N[C@@H]1C[C@H]1c1ccc(NC(=O)c2ccc(NC(=O)OCc3ccccc3)c(c2)N2CCOCC2)cc1 |r|
Show InChI InChI=1S/C28H30N4O4.ClH/c29-24-17-23(24)20-6-9-22(10-7-20)30-27(33)21-8-11-25(26(16-21)32-12-14-35-15-13-32)31-28(34)36-18-19-4-2-1-3-5-19;/h1-11,16,23-24H,12-15,17-18,29H2,(H,30,33)(H,31,34);1H/t23-,24+;/m0./s1
n/an/a 345n/an/an/an/an/an/a
European Institute of Oncology
Curated by ChEMBL
Assay Description
Inhibition of human recombinant MAOA expressed in Pichia pastoris preincubated for 15 mins measured after 30 mins by bioluminescent-coupled assay
J Med Chem 59: 1501-17 (2016)
BindingDB Entry DOI: 10.7270/Q2086767
Lysine-specific histone demethylase 1B
(Homo sapiens (Human))
BDBM50155770
(CHEMBL3781885)
Show SMILES Cl.N[C@@H]1C[C@H]1c1ccc(NC(=O)c2ccc(NC(=O)OCc3ccccc3)c(c2)N2CCOCC2)cc1 |r|
Show InChI InChI=1S/C28H30N4O4.ClH/c29-24-17-23(24)20-6-9-22(10-7-20)30-27(33)21-8-11-25(26(16-21)32-12-14-35-15-13-32)31-28(34)36-18-19-4-2-1-3-5-19;/h1-11,16,23-24H,12-15,17-18,29H2,(H,30,33)(H,31,34);1H/t23-,24+;/m0./s1
Reactome pathway
n/an/a 1.49E+4n/an/an/an/an/an/a
European Institute of Oncology
Curated by ChEMBL
Assay Description
Inhibition of KDM1B (unknown origin)
J Med Chem 59: 1501-17 (2016)
BindingDB Entry DOI: 10.7270/Q2086767
Amine oxidase [flavin-containing] B
(Homo sapiens (Human))
BDBM50155770
(CHEMBL3781885)
Show SMILES Cl.N[C@@H]1C[C@H]1c1ccc(NC(=O)c2ccc(NC(=O)OCc3ccccc3)c(c2)N2CCOCC2)cc1 |r|
Show InChI InChI=1S/C28H30N4O4.ClH/c29-24-17-23(24)20-6-9-22(10-7-20)30-27(33)21-8-11-25(26(16-21)32-12-14-35-15-13-32)31-28(34)36-18-19-4-2-1-3-5-19;/h1-11,16,23-24H,12-15,17-18,29H2,(H,30,33)(H,31,34);1H/t23-,24+;/m0./s1
n/an/a 2.78E+4n/an/an/an/an/an/a
European Institute of Oncology
Curated by ChEMBL
Assay Description
Inhibition of human recombinant MAOB expressed in Pichia pastoris preincubated for 15 mins measured after 30 mins by bioluminescent-coupled assay
J Med Chem 59: 1501-17 (2016)
BindingDB Entry DOI: 10.7270/Q2086767