BDBM50155772 CHEMBL3780774
SMILES: Cl.N[C@@H]1C[C@H]1c1ccc(NC(=O)c2ccc(N3CCCCC3)c(NC(=O)OCc3ccccc3)c2)cc1
InChI Key: InChIKey=FYQMFGITROVBSR-CLSOAGJSSA-N
Data: 4 IC50
Activity Spreadsheet -- Enzyme Inhibition Constant Data from BindingDB
Found 4 hits for monomerid = 50155772
Trg + Lig
Ki
nM
ΔG°
kcal/mole
IC50
nM
Kd
nM
EC50/IC50
nM
koff
s-1
kon
M-1s-1
pHTemp
°C
REST corepressor 1
(Homo sapiens (Human))
BDBM50155772
(CHEMBL3780774)
Show SMILES Cl.N[C@@H]1C[C@H]1c1ccc(NC(=O)c2ccc(N3CCCCC3)c(NC(=O)OCc3ccccc3)c2)cc1 |r|
Show InChI InChI=1S/C29H32N4O3.ClH/c30-25-18-24(25)21-9-12-23(13-10-21)31-28(34)22-11-14-27(33-15-5-2-6-16-33)26(17-22)32-29(35)36-19-20-7-3-1-4-8-20;/h1,3-4,7-14,17,24-25H,2,5-6,15-16,18-19,30H2,(H,31,34)(H,32,35);1H/t24-,25+;/m0./s1
Reactome pathway
n/an/a 308n/an/an/an/an/an/a
European Institute of Oncology
Curated by ChEMBL
Assay Description
Inhibition of human recombinant KDM1A/CoREST expressed in Escherichia coli using mono-methylated H3-K4 peptide as substrate assessed as H2O2 release ...
J Med Chem 59: 1501-17 (2016)
BindingDB Entry DOI: 10.7270/Q2086767
Lysine-specific histone demethylase 1B
(Homo sapiens (Human))
BDBM50155772
(CHEMBL3780774)
Show SMILES Cl.N[C@@H]1C[C@H]1c1ccc(NC(=O)c2ccc(N3CCCCC3)c(NC(=O)OCc3ccccc3)c2)cc1 |r|
Show InChI InChI=1S/C29H32N4O3.ClH/c30-25-18-24(25)21-9-12-23(13-10-21)31-28(34)22-11-14-27(33-15-5-2-6-16-33)26(17-22)32-29(35)36-19-20-7-3-1-4-8-20;/h1,3-4,7-14,17,24-25H,2,5-6,15-16,18-19,30H2,(H,31,34)(H,32,35);1H/t24-,25+;/m0./s1
Reactome pathway
n/an/a 4.30E+3n/an/an/an/an/an/a
European Institute of Oncology
Curated by ChEMBL
Assay Description
Inhibition of KDM1B (unknown origin)
J Med Chem 59: 1501-17 (2016)
BindingDB Entry DOI: 10.7270/Q2086767
Amine oxidase [flavin-containing] B
(Homo sapiens (Human))
BDBM50155772
(CHEMBL3780774)
Show SMILES Cl.N[C@@H]1C[C@H]1c1ccc(NC(=O)c2ccc(N3CCCCC3)c(NC(=O)OCc3ccccc3)c2)cc1 |r|
Show InChI InChI=1S/C29H32N4O3.ClH/c30-25-18-24(25)21-9-12-23(13-10-21)31-28(34)22-11-14-27(33-15-5-2-6-16-33)26(17-22)32-29(35)36-19-20-7-3-1-4-8-20;/h1,3-4,7-14,17,24-25H,2,5-6,15-16,18-19,30H2,(H,31,34)(H,32,35);1H/t24-,25+;/m0./s1
n/an/a 3.30E+4n/an/an/an/an/an/a
European Institute of Oncology
Curated by ChEMBL
Assay Description
Inhibition of human recombinant MAOB expressed in Pichia pastoris preincubated for 15 mins measured after 30 mins by bioluminescent-coupled assay
J Med Chem 59: 1501-17 (2016)
BindingDB Entry DOI: 10.7270/Q2086767
Amine oxidase (flavin-containing) A
(Homo sapiens (Human))
BDBM50155772
(CHEMBL3780774)
Show SMILES Cl.N[C@@H]1C[C@H]1c1ccc(NC(=O)c2ccc(N3CCCCC3)c(NC(=O)OCc3ccccc3)c2)cc1 |r|
Show InChI InChI=1S/C29H32N4O3.ClH/c30-25-18-24(25)21-9-12-23(13-10-21)31-28(34)22-11-14-27(33-15-5-2-6-16-33)26(17-22)32-29(35)36-19-20-7-3-1-4-8-20;/h1,3-4,7-14,17,24-25H,2,5-6,15-16,18-19,30H2,(H,31,34)(H,32,35);1H/t24-,25+;/m0./s1
n/an/a 687n/an/an/an/an/an/a
European Institute of Oncology
Curated by ChEMBL
Assay Description
Inhibition of human recombinant MAOA expressed in Pichia pastoris preincubated for 15 mins measured after 30 mins by bioluminescent-coupled assay
J Med Chem 59: 1501-17 (2016)
BindingDB Entry DOI: 10.7270/Q2086767