BDBM50155774 CHEMBL3780776
SMILES: Cc1cc(O)cc(C)c1C[C@H](N)C(=O)N[C@H](CCCNC(N)=N)C(=O)N[C@@H](Cc1ccccc1)C(=O)N[C@@H](CCCCN)C(=O)N1CCN(CC1)[C@@H]1CCN(C[C@@H]1c1ccccc1)C(=O)c1cc(cc(c1)C(F)(F)F)C(F)(F)F
InChI Key: InChIKey=WCJDWNUHDMSTQS-QEHHYHKYSA-N
Data: 3 KI  2 IC50
Activity Spreadsheet -- Enzyme Inhibition Constant Data from BindingDB
Found 5 hits for monomerid = 50155774
Trg + Lig
Ki
nM
ΔG°
kcal/mole
IC50
nM
Kd
nM
EC50/IC50
nM
koff
s-1
kon
M-1s-1
pHTemp
°C
Neurokinin 1 receptor
(Homo sapiens (Human))
BDBM50155774
(CHEMBL3780776)
Show SMILES Cc1cc(O)cc(C)c1C[C@H](N)C(=O)N[C@H](CCCNC(N)=N)C(=O)N[C@@H](Cc1ccccc1)C(=O)N[C@@H](CCCCN)C(=O)N1CCN(CC1)[C@@H]1CCN(C[C@@H]1c1ccccc1)C(=O)c1cc(cc(c1)C(F)(F)F)C(F)(F)F |r|
Show InChI InChI=1S/C56H71F6N11O6/c1-34-26-41(74)27-35(2)42(34)32-44(64)49(75)68-45(17-11-20-67-54(65)66)50(76)70-47(28-36-12-5-3-6-13-36)51(77)69-46(16-9-10-19-63)53(79)72-24-22-71(23-25-72)48-18-21-73(33-43(48)37-14-7-4-8-15-37)52(78)38-29-39(55(57,58)59)31-40(30-38)56(60,61)62/h3-8,12-15,26-27,29-31,43-48,74H,9-11,16-25,28,32-33,63-64H2,1-2H3,(H,68,75)(H,69,77)(H,70,76)(H4,65,66,67)/t43-,44+,45-,46+,47+,48-/m1/s1
Reactome pathway
0.990n/an/an/an/an/an/an/an/a
Vrije Universiteit Brussel
Curated by ChEMBL
Assay Description
Displacement of [3H]SP from human NK1 receptor transfected in CHO cells by liquid scintillation counting method
ACS Med Chem Lett 6: 1209-14 (2015)
BindingDB Entry DOI: 10.7270/Q2VH5QQJ
Mu-type opioid receptor
(Rattus norvegicus (rat))
BDBM50155774
(CHEMBL3780776)
Show SMILES Cc1cc(O)cc(C)c1C[C@H](N)C(=O)N[C@H](CCCNC(N)=N)C(=O)N[C@@H](Cc1ccccc1)C(=O)N[C@@H](CCCCN)C(=O)N1CCN(CC1)[C@@H]1CCN(C[C@@H]1c1ccccc1)C(=O)c1cc(cc(c1)C(F)(F)F)C(F)(F)F |r|
Show InChI InChI=1S/C56H71F6N11O6/c1-34-26-41(74)27-35(2)42(34)32-44(64)49(75)68-45(17-11-20-67-54(65)66)50(76)70-47(28-36-12-5-3-6-13-36)51(77)69-46(16-9-10-19-63)53(79)72-24-22-71(23-25-72)48-18-21-73(33-43(48)37-14-7-4-8-15-37)52(78)38-29-39(55(57,58)59)31-40(30-38)56(60,61)62/h3-8,12-15,26-27,29-31,43-48,74H,9-11,16-25,28,32-33,63-64H2,1-2H3,(H,68,75)(H,69,77)(H,70,76)(H4,65,66,67)/t43-,44+,45-,46+,47+,48-/m1/s1
Reactome pathway
9.90n/an/an/an/an/an/an/an/a
Vrije Universiteit Brussel
Curated by ChEMBL
Assay Description
Displacement of [3H]DAMGO from mu opioid receptor in rat brain membrane after 2 hrs
ACS Med Chem Lett 6: 1209-14 (2015)
BindingDB Entry DOI: 10.7270/Q2VH5QQJ
Opioid receptors; mu & delta
(Rattus norvegicus (rat))
BDBM50155774
(CHEMBL3780776)
Show SMILES Cc1cc(O)cc(C)c1C[C@H](N)C(=O)N[C@H](CCCNC(N)=N)C(=O)N[C@@H](Cc1ccccc1)C(=O)N[C@@H](CCCCN)C(=O)N1CCN(CC1)[C@@H]1CCN(C[C@@H]1c1ccccc1)C(=O)c1cc(cc(c1)C(F)(F)F)C(F)(F)F |r|
Show InChI InChI=1S/C56H71F6N11O6/c1-34-26-41(74)27-35(2)42(34)32-44(64)49(75)68-45(17-11-20-67-54(65)66)50(76)70-47(28-36-12-5-3-6-13-36)51(77)69-46(16-9-10-19-63)53(79)72-24-22-71(23-25-72)48-18-21-73(33-43(48)37-14-7-4-8-15-37)52(78)38-29-39(55(57,58)59)31-40(30-38)56(60,61)62/h3-8,12-15,26-27,29-31,43-48,74H,9-11,16-25,28,32-33,63-64H2,1-2H3,(H,68,75)(H,69,77)(H,70,76)(H4,65,66,67)/t43-,44+,45-,46+,47+,48-/m1/s1
Reactome pathway
533n/an/an/an/an/an/an/an/a
Vrije Universiteit Brussel
Curated by ChEMBL
Assay Description
Displacement of [3H]DSLET from delta opioid receptor in rat brain membrane after 2 hrs
ACS Med Chem Lett 6: 1209-14 (2015)
BindingDB Entry DOI: 10.7270/Q2VH5QQJ
Delta-type opioid receptor
(MOUSE)
BDBM50155774
(CHEMBL3780776)
Show SMILES Cc1cc(O)cc(C)c1C[C@H](N)C(=O)N[C@H](CCCNC(N)=N)C(=O)N[C@@H](Cc1ccccc1)C(=O)N[C@@H](CCCCN)C(=O)N1CCN(CC1)[C@@H]1CCN(C[C@@H]1c1ccccc1)C(=O)c1cc(cc(c1)C(F)(F)F)C(F)(F)F |r|
Show InChI InChI=1S/C56H71F6N11O6/c1-34-26-41(74)27-35(2)42(34)32-44(64)49(75)68-45(17-11-20-67-54(65)66)50(76)70-47(28-36-12-5-3-6-13-36)51(77)69-46(16-9-10-19-63)53(79)72-24-22-71(23-25-72)48-18-21-73(33-43(48)37-14-7-4-8-15-37)52(78)38-29-39(55(57,58)59)31-40(30-38)56(60,61)62/h3-8,12-15,26-27,29-31,43-48,74H,9-11,16-25,28,32-33,63-64H2,1-2H3,(H,68,75)(H,69,77)(H,70,76)(H4,65,66,67)/t43-,44+,45-,46+,47+,48-/m1/s1
Reactome pathway
n/an/a 384n/an/an/an/an/an/a
Vrije Universiteit Brussel
Curated by ChEMBL
Assay Description
Agonist activity at delta opioid receptor in mouse vas deferens assessed as inhibition of electrically-stimulated muscle contraction
ACS Med Chem Lett 6: 1209-14 (2015)
BindingDB Entry DOI: 10.7270/Q2VH5QQJ
Mu-type opioid receptor
(GUINEA PIG)
BDBM50155774
(CHEMBL3780776)
Show SMILES Cc1cc(O)cc(C)c1C[C@H](N)C(=O)N[C@H](CCCNC(N)=N)C(=O)N[C@@H](Cc1ccccc1)C(=O)N[C@@H](CCCCN)C(=O)N1CCN(CC1)[C@@H]1CCN(C[C@@H]1c1ccccc1)C(=O)c1cc(cc(c1)C(F)(F)F)C(F)(F)F |r|
Show InChI InChI=1S/C56H71F6N11O6/c1-34-26-41(74)27-35(2)42(34)32-44(64)49(75)68-45(17-11-20-67-54(65)66)50(76)70-47(28-36-12-5-3-6-13-36)51(77)69-46(16-9-10-19-63)53(79)72-24-22-71(23-25-72)48-18-21-73(33-43(48)37-14-7-4-8-15-37)52(78)38-29-39(55(57,58)59)31-40(30-38)56(60,61)62/h3-8,12-15,26-27,29-31,43-48,74H,9-11,16-25,28,32-33,63-64H2,1-2H3,(H,68,75)(H,69,77)(H,70,76)(H4,65,66,67)/t43-,44+,45-,46+,47+,48-/m1/s1
n/an/a 137n/an/an/an/an/an/a
Vrije Universiteit Brussel
Curated by ChEMBL
Assay Description
Agonist activity at mu opioid receptor in guinea pig ileum assessed as inhibition of electrically-stimulated muscle contraction
ACS Med Chem Lett 6: 1209-14 (2015)
BindingDB Entry DOI: 10.7270/Q2VH5QQJ