BDBM50155836 (R)-5-[(S)-2-(2-Hydroxy-acetyl)-pyrrolidine-1-carbonyl]-cyclopent-1-enecarboxylic acid benzylamide::CHEMBL365843
SMILES: OCC(=O)[C@@H]1CCCN1C(=O)[C@@H]1CCC=C1C(=O)NCc1ccccc1
InChI Key: InChIKey=VPNMCINSWMVXMW-SJORKVTESA-N
Data: 1 KI  1 IC50
Activity Spreadsheet -- Enzyme Inhibition Constant Data from BindingDB
Found 2 hits for monomerid = 50155836
Trg + Lig
Ki
nM
ΔG°
kcal/mole
IC50
nM
Kd
nM
EC50/IC50
nM
koff
s-1
kon
M-1s-1
pHTemp
°C
Prolyl endopeptidase
(Sus scrofa)
BDBM50155836
((R)-5-[(S)-2-(2-Hydroxy-acetyl)-pyrrolidine-1-carb...)
Show SMILES OCC(=O)[C@@H]1CCCN1C(=O)[C@@H]1CCC=C1C(=O)NCc1ccccc1 |c:15|
Show InChI InChI=1S/C20H24N2O4/c23-13-18(24)17-10-5-11-22(17)20(26)16-9-4-8-15(16)19(25)21-12-14-6-2-1-3-7-14/h1-3,6-8,16-17,23H,4-5,9-13H2,(H,21,25)/t16-,17+/m1/s1
0.150n/an/an/an/an/an/an/an/a
University of Kuopio
Curated by ChEMBL
Assay Description
Inhibitory activity against prolyl oligopeptidase of porcine brain homogenate
J Med Chem 47: 5605-7 (2004)
Article DOI: 10.1021/jm049503w
BindingDB Entry DOI: 10.7270/Q25D8R9G
Prolyl endopeptidase
(Sus scrofa)
BDBM50155836
((R)-5-[(S)-2-(2-Hydroxy-acetyl)-pyrrolidine-1-carb...)
Show SMILES OCC(=O)[C@@H]1CCCN1C(=O)[C@@H]1CCC=C1C(=O)NCc1ccccc1 |c:15|
Show InChI InChI=1S/C20H24N2O4/c23-13-18(24)17-10-5-11-22(17)20(26)16-9-4-8-15(16)19(25)21-12-14-6-2-1-3-7-14/h1-3,6-8,16-17,23H,4-5,9-13H2,(H,21,25)/t16-,17+/m1/s1
n/an/a 0.300n/an/an/an/an/an/a
University of Kuopio
Curated by ChEMBL
Assay Description
Inhibitory activity against prolyl oligopeptidase of porcine brain homogenate
J Med Chem 47: 5605-7 (2004)
Article DOI: 10.1021/jm049503w
BindingDB Entry DOI: 10.7270/Q25D8R9G