BDBM50155982 8-(Butyl-ethyl-amino)-4-(2-chloro-4-methoxy-phenyl)-6-methyl-3,4-dihydro-1H-pyrido[2,3-b]pyrazin-2-one; TFA::CHEMBL187073
SMILES: CCCCN(CC)c1cc(C)nc2N(CC(=O)Nc12)c1ccc(OC)cc1Cl
InChI Key: InChIKey=HIWZQHWIEHZKPN-UHFFFAOYSA-N
Data: 1 IC50
Activity Spreadsheet -- Enzyme Inhibition Constant Data from BindingDB
Found 1 hit for monomerid = 50155982
Trg + Lig
Ki
nM
ΔG°
kcal/mole
IC50
nM
Kd
nM
EC50/IC50
nM
koff
s-1
kon
M-1s-1
pHTemp
°C
Corticotropin releasing factor receptor
(Rattus norvegicus (rat))
BDBM50155982
(8-(Butyl-ethyl-amino)-4-(2-chloro-4-methoxy-phenyl...)
Show SMILES CCCCN(CC)c1cc(C)nc2N(CC(=O)Nc12)c1ccc(OC)cc1Cl
Show InChI InChI=1S/C21H27ClN4O2/c1-5-7-10-25(6-2)18-11-14(3)23-21-20(18)24-19(27)13-26(21)17-9-8-15(28-4)12-16(17)22/h8-9,11-12H,5-7,10,13H2,1-4H3,(H,24,27)
Reactome pathway
n/an/a 0.300n/an/an/an/an/an/a
Bristol-Myers Squibb Pharmaceutical Research Institute
Curated by ChEMBL
Assay Description
Inhibition of [125I]-ovine-CRF binding to corticotropin releasing factor receptor 1
J Med Chem 47: 5783-90 (2004)
Article DOI: 10.1021/jm049737f
BindingDB Entry DOI: 10.7270/Q2S75FT6