BDBM50156120 CHEMBL3780056
SMILES: CCCCCCCCCCCCCCCCCC(=O)OC[C@@H](O)COP(O)(=O)O[C@H]1[C@H](O)[C@@H](O)[C@H](O)[C@@H](O)[C@H]1O
InChI Key: InChIKey=MXAFDFDAIFZFET-CZDOQZASSA-N
Data: 1 EC50
Activity Spreadsheet -- Enzyme Inhibition Constant Data from BindingDB
Found 1 hit for monomerid = 50156120
Trg + Lig
Ki
nM
ΔG°
kcal/mole
IC50
nM
Kd
nM
EC50/IC50
nM
koff
s-1
kon
M-1s-1
pHTemp
°C
G-protein coupled receptor 55
(Homo sapiens (Human))
BDBM50156120
(CHEMBL3780056)
Show SMILES CCCCCCCCCCCCCCCCCC(=O)OC[C@@H](O)COP(O)(=O)O[C@H]1[C@H](O)[C@@H](O)[C@H](O)[C@@H](O)[C@H]1O |r|
Show InChI InChI=1S/C27H53O12P/c1-2-3-4-5-6-7-8-9-10-11-12-13-14-15-16-17-21(29)37-18-20(28)19-38-40(35,36)39-27-25(33)23(31)22(30)24(32)26(27)34/h20,22-28,30-34H,2-19H2,1H3,(H,35,36)/t20-,22-,23-,24+,25-,26-,27-/m1/s1
Reactome pathway
n/an/an/an/a 2.80n/an/an/an/a
Instituto de Qu£mica M£dica
Curated by ChEMBL
Assay Description
Agonist activity at recombinant human GPR55 expressed in HEK293 cells after 5 mins by xCELLigence assay
J Med Chem 59: 1840-53 (2016)
BindingDB Entry DOI: 10.7270/Q2BK1F8X