BDBM50156137 CHEMBL3780714
SMILES: Cc1ccc(cc1)-n1nc(cc1NC(=O)Nc1ccc(OCc2ccnc(NS(C)(=O)=O)c2)c2ccccc12)C(C)(C)C
InChI Key: InChIKey=OIUJKHYYCHMFEB-UHFFFAOYSA-N
Data: 3 IC50
Activity Spreadsheet -- Enzyme Inhibition Constant Data from BindingDB
Found 3 hits for monomerid = 50156137
Trg + Lig
Ki
nM
ΔG°
kcal/mole
IC50
nM
Kd
nM
EC50/IC50
nM
koff
s-1
kon
M-1s-1
pHTemp
°C
Mitogen-activated protein kinase 12
(Homo sapiens (Human))
BDBM50156137
(CHEMBL3780714)
Show SMILES Cc1ccc(cc1)-n1nc(cc1NC(=O)Nc1ccc(OCc2ccnc(NS(C)(=O)=O)c2)c2ccccc12)C(C)(C)C
Show InChI InChI=1S/C32H34N6O4S/c1-21-10-12-23(13-11-21)38-30(19-28(36-38)32(2,3)4)35-31(39)34-26-14-15-27(25-9-7-6-8-24(25)26)42-20-22-16-17-33-29(18-22)37-43(5,40)41/h6-19H,20H2,1-5H3,(H,33,37)(H2,34,35,39)
Reactome pathway
n/an/a 303n/an/an/an/an/an/a
Sygnature Discovery Limited
Curated by ChEMBL
Assay Description
Inhibitory concentration required for in vitro binding affinity to Nicotinic acetylcholine receptor alpha3-beta2 expressed on cell line sf 9 by using...
J Med Chem 59: 1727-46 (2016)
BindingDB Entry DOI: 10.7270/Q2319XRB
Mitogen-activated protein kinase 14
(Homo sapiens (Human))
BDBM50156137
(CHEMBL3780714)
Show SMILES Cc1ccc(cc1)-n1nc(cc1NC(=O)Nc1ccc(OCc2ccnc(NS(C)(=O)=O)c2)c2ccccc12)C(C)(C)C
Show InChI InChI=1S/C32H34N6O4S/c1-21-10-12-23(13-11-21)38-30(19-28(36-38)32(2,3)4)35-31(39)34-26-14-15-27(25-9-7-6-8-24(25)26)42-20-22-16-17-33-29(18-22)37-43(5,40)41/h6-19H,20H2,1-5H3,(H,33,37)(H2,34,35,39)
NCI pathway
Reactome pathway
n/an/a 18n/an/an/an/an/an/a
Sygnature Discovery Limited
Curated by ChEMBL
Assay Description
Inhibition of human recombinant p38 alpha assessed as phosphorylation of MAPKAP-K2 preincubated for 2 hrs followed by FRET peptide and MAPKAP-K2 addi...
J Med Chem 59: 1727-46 (2016)
BindingDB Entry DOI: 10.7270/Q2319XRB
Tyrosine-protein kinase HCK
(Homo sapiens (Human))
BDBM50156137
(CHEMBL3780714)
Show SMILES Cc1ccc(cc1)-n1nc(cc1NC(=O)Nc1ccc(OCc2ccnc(NS(C)(=O)=O)c2)c2ccccc12)C(C)(C)C
Show InChI InChI=1S/C32H34N6O4S/c1-21-10-12-23(13-11-21)38-30(19-28(36-38)32(2,3)4)35-31(39)34-26-14-15-27(25-9-7-6-8-24(25)26)42-20-22-16-17-33-29(18-22)37-43(5,40)41/h6-19H,20H2,1-5H3,(H,33,37)(H2,34,35,39)
Reactome pathway
n/an/a 2.14E+3n/an/an/an/an/an/a
Sygnature Discovery Limited
Curated by ChEMBL
Assay Description
Inhibition of HCK (unknown origin) preincubated for 2 hrs followed by FRET peptide addition measured after 1 hr by Z-LYTE assay
J Med Chem 59: 1727-46 (2016)
BindingDB Entry DOI: 10.7270/Q2319XRB