BDBM50156144 CHEMBL3781687
SMILES: CNC(=O)Nc1cc(CCOc2ccc(NC(=O)Nc3cc(nn3-c3ccc(C)cc3)C(C)(C)C)c3ccccc23)ccn1
InChI Key: InChIKey=ATSRNUWJDQUCNU-UHFFFAOYSA-N
Data: 3 IC50
Activity Spreadsheet -- Enzyme Inhibition Constant Data from BindingDB
Found 3 hits for monomerid = 50156144
Trg + Lig
Ki
nM
ΔG°
kcal/mole
IC50
nM
Kd
nM
EC50/IC50
nM
koff
s-1
kon
M-1s-1
pHTemp
°C
Mitogen-activated protein kinase 12
(Homo sapiens (Human))
BDBM50156144
(CHEMBL3781687)
Show SMILES CNC(=O)Nc1cc(CCOc2ccc(NC(=O)Nc3cc(nn3-c3ccc(C)cc3)C(C)(C)C)c3ccccc23)ccn1
Show InChI InChI=1S/C34H37N7O3/c1-22-10-12-24(13-11-22)41-31(21-29(40-41)34(2,3)4)39-33(43)37-27-14-15-28(26-9-7-6-8-25(26)27)44-19-17-23-16-18-36-30(20-23)38-32(42)35-5/h6-16,18,20-21H,17,19H2,1-5H3,(H2,37,39,43)(H2,35,36,38,42)
Reactome pathway
n/an/a 169n/an/an/an/an/an/a
Sygnature Discovery Limited
Curated by ChEMBL
Assay Description
Inhibition of human recombinant p38 gamma assessed as phosphorylation of MAPKAP-K2 preincubated for 2 hrs followed by FRET peptide and MAPKAP-K2 addi...
J Med Chem 59: 1727-46 (2016)
BindingDB Entry DOI: 10.7270/Q2319XRB
Mitogen-activated protein kinase 14
(Homo sapiens (Human))
BDBM50156144
(CHEMBL3781687)
Show SMILES CNC(=O)Nc1cc(CCOc2ccc(NC(=O)Nc3cc(nn3-c3ccc(C)cc3)C(C)(C)C)c3ccccc23)ccn1
Show InChI InChI=1S/C34H37N7O3/c1-22-10-12-24(13-11-22)41-31(21-29(40-41)34(2,3)4)39-33(43)37-27-14-15-28(26-9-7-6-8-25(26)27)44-19-17-23-16-18-36-30(20-23)38-32(42)35-5/h6-16,18,20-21H,17,19H2,1-5H3,(H2,37,39,43)(H2,35,36,38,42)
NCI pathway
Reactome pathway
n/an/a 6n/an/an/an/an/an/a
Sygnature Discovery Limited
Curated by ChEMBL
Assay Description
Inhibition of human recombinant p38 alpha assessed as phosphorylation of MAPKAP-K2 preincubated for 2 hrs followed by FRET peptide and MAPKAP-K2 addi...
J Med Chem 59: 1727-46 (2016)
BindingDB Entry DOI: 10.7270/Q2319XRB
Tyrosine-protein kinase HCK
(Homo sapiens (Human))
BDBM50156144
(CHEMBL3781687)
Show SMILES CNC(=O)Nc1cc(CCOc2ccc(NC(=O)Nc3cc(nn3-c3ccc(C)cc3)C(C)(C)C)c3ccccc23)ccn1
Show InChI InChI=1S/C34H37N7O3/c1-22-10-12-24(13-11-22)41-31(21-29(40-41)34(2,3)4)39-33(43)37-27-14-15-28(26-9-7-6-8-25(26)27)44-19-17-23-16-18-36-30(20-23)38-32(42)35-5/h6-16,18,20-21H,17,19H2,1-5H3,(H2,37,39,43)(H2,35,36,38,42)
Reactome pathway
n/an/a 26n/an/an/an/an/an/a
Sygnature Discovery Limited
Curated by ChEMBL
Assay Description
Inhibition of HCK (unknown origin) preincubated for 2 hrs followed by FRET peptide addition measured after 1 hr by Z-LYTE assay
J Med Chem 59: 1727-46 (2016)
BindingDB Entry DOI: 10.7270/Q2319XRB