BDBM50156209 CHEMBL3780579
SMILES: COc1ccc(cc1N1CCN(C)CC1)S(=O)(=O)NCC(C)(C)c1cccc2ccc(Br)cc12
InChI Key: InChIKey=HHQSQESJYDHJPT-UHFFFAOYSA-N
Data: 1 IC50
Activity Spreadsheet -- Enzyme Inhibition Constant Data from BindingDB
Found 1 hit for monomerid = 50156209
Trg + Lig
Ki
nM
ΔG°
kcal/mole
IC50
nM
Kd
nM
EC50/IC50
nM
koff
s-1
kon
M-1s-1
pHTemp
°C
5-hydroxytryptamine receptor 6
(Homo sapiens (Human))
BDBM50156209
(CHEMBL3780579)
Show SMILES COc1ccc(cc1N1CCN(C)CC1)S(=O)(=O)NCC(C)(C)c1cccc2ccc(Br)cc12
Show InChI InChI=1S/C26H32BrN3O3S/c1-26(2,23-7-5-6-19-8-9-20(27)16-22(19)23)18-28-34(31,32)21-10-11-25(33-4)24(17-21)30-14-12-29(3)13-15-30/h5-11,16-17,28H,12-15,18H2,1-4H3
Reactome pathway
n/an/a 0.310n/an/an/an/an/an/a
Temple University
Curated by ChEMBL
Assay Description
Displacement of [3H]LSD from human 5-HT6 receptor expressed in CHO cell membranes after 120 mins by liquid scintillation counting method
ACS Med Chem Lett 7: 12-4 (2016)
BindingDB Entry DOI: 10.7270/Q2Z89F8F