BDBM50156237 CHEMBL3781487
SMILES: Cc1ccncc1-c1cccc2n(cnc12)-c1nccs1
InChI Key: InChIKey=SEIPEHNSZOQMSZ-UHFFFAOYSA-N
Data: 2 IC50
Activity Spreadsheet -- Enzyme Inhibition Constant Data from BindingDB
Found 2 hits for monomerid = 50156237
Trg + Lig
Ki
nM
ΔG°
kcal/mole
IC50
nM
Kd
nM
EC50/IC50
nM
koff
s-1
kon
M-1s-1
pHTemp
°C
Cytochrome P450 1A
(Homo sapiens (Human))
BDBM50156237
(CHEMBL3781487)
Show SMILES Cc1ccncc1-c1cccc2n(cnc12)-c1nccs1
Show InChI InChI=1S/C16H12N4S/c1-11-5-6-17-9-13(11)12-3-2-4-14-15(12)19-10-20(14)16-18-7-8-21-16/h2-10H,1H3
Reactome pathway
n/an/a 75n/an/an/an/an/an/a
Bristol-Myers Squibb Research and Development
Curated by ChEMBL
Assay Description
Inhibition of CYP1A2 (unknown origin)
ACS Med Chem Lett 7: 40-5 (2016)
BindingDB Entry DOI: 10.7270/Q2TH8PK5
Cytochrome P450 17A1
(Homo sapiens (Human))
BDBM50156237
(CHEMBL3781487)
Show SMILES Cc1ccncc1-c1cccc2n(cnc12)-c1nccs1
Show InChI InChI=1S/C16H12N4S/c1-11-5-6-17-9-13(11)12-3-2-4-14-15(12)19-10-20(14)16-18-7-8-21-16/h2-10H,1H3
Reactome pathway
n/an/a 8n/an/an/an/an/an/a
Bristol-Myers Squibb Research and Development
Curated by ChEMBL
Assay Description
Inhibition of human CYP17A1 expressed in HEK293 cell microsomes using [3H]-pregnenolone as substrate incubated for 45 mins by scintillation proximity...
ACS Med Chem Lett 7: 40-5 (2016)
BindingDB Entry DOI: 10.7270/Q2TH8PK5