BDBM50156348 CHEMBL3786495
SMILES: C[C@H](c1nnc2c(F)cc(cn12)-c1cc(C)no1)n1ccc2ncccc2c1=O
InChI Key: InChIKey=MUXVJMKIENAXGE-GFCCVEGCSA-N
Data: 2 IC50
PDB links: 1 PDB ID matches this monomer.
Activity Spreadsheet -- Enzyme Inhibition Constant Data from BindingDB
Found 2 hits for monomerid = 50156348
Trg + Lig
Ki
nM
ΔG°
kcal/mole
IC50
nM
Kd
nM
EC50/IC50
nM
koff
s-1
kon
M-1s-1
pHTemp
°C
Hepatocyte growth factor receptor
(Homo sapiens (Human))
BDBM50156348
(CHEMBL3786495)
Show SMILES C[C@H](c1nnc2c(F)cc(cn12)-c1cc(C)no1)n1ccc2ncccc2c1=O |r|
Show InChI InChI=1S/C20H15FN6O2/c1-11-8-17(29-25-11)13-9-15(21)19-24-23-18(27(19)10-13)12(2)26-7-5-16-14(20(26)28)4-3-6-22-16/h3-10,12H,1-2H3/t12-/m1/s1
n/an/a 3n/an/an/an/an/an/a
Amgen Inc
Curated by ChEMBL
Assay Description
Inhibition of recombinant MET (unknown origin) using gastrin peptide as substrate preincubated for 30 mins followed by substrate addition incubated f...
J Med Chem 59: 2328-42 (2016)
BindingDB Entry DOI: 10.7270/Q2SN0BVN
3D
3D Structure (crystal)
Hepatocyte growth factor receptor
(Homo sapiens (Human))
BDBM50156348
(CHEMBL3786495)
Show SMILES C[C@H](c1nnc2c(F)cc(cn12)-c1cc(C)no1)n1ccc2ncccc2c1=O |r|
Show InChI InChI=1S/C20H15FN6O2/c1-11-8-17(29-25-11)13-9-15(21)19-24-23-18(27(19)10-13)12(2)26-7-5-16-14(20(26)28)4-3-6-22-16/h3-10,12H,1-2H3/t12-/m1/s1
n/an/a 9n/an/an/an/an/an/a
Amgen Inc
Curated by ChEMBL
Assay Description
Inhibition of recombinant MET (unknown origin) using gastrin peptide as substrate preincubated for 30 mins followed by substrate addition incubated f...
J Med Chem 59: 2328-42 (2016)
BindingDB Entry DOI: 10.7270/Q2SN0BVN
3D
3D Structure (crystal)