BDBM50156419 (R)-1-(2-Methyl-benzothiazol-5-yloxy)-3-{4-[5-methyl-2-(4-trifluoromethyl-phenyl)-thiazol-4-ylmethyl]-piperazin-1-yl}-propan-2-ol::CHEMBL364617
SMILES: Cc1nc2cc(OC[C@H](O)CN3CCN(Cc4nc(sc4C)-c4ccc(cc4)C(F)(F)F)CC3)ccc2s1
InChI Key: InChIKey=MJRCPIQPPFELOL-OAQYLSRUSA-N
Data: 1 IC50
Activity Spreadsheet -- Enzyme Inhibition Constant Data from BindingDB
Found 1 hit for monomerid = 50156419
Trg + Lig
Ki
nM
ΔG°
kcal/mole
IC50
nM
Kd
nM
EC50/IC50
nM
koff
s-1
kon
M-1s-1
pHTemp
°C
Palmitoyl-CoA oxidase
(Rattus norvegicus)
BDBM50156419
((R)-1-(2-Methyl-benzothiazol-5-yloxy)-3-{4-[5-meth...)
Show SMILES Cc1nc2cc(OC[C@H](O)CN3CCN(Cc4nc(sc4C)-c4ccc(cc4)C(F)(F)F)CC3)ccc2s1
Show InChI InChI=1S/C27H29F3N4O2S2/c1-17-24(32-26(37-17)19-3-5-20(6-4-19)27(28,29)30)15-34-11-9-33(10-12-34)14-21(35)16-36-22-7-8-25-23(13-22)31-18(2)38-25/h3-8,13,21,35H,9-12,14-16H2,1-2H3/t21-/m1/s1
Reactome pathway
n/an/a 1.50E+3n/an/an/an/an/an/a
CV Therapeutics, Inc.
Curated by ChEMBL
Assay Description
Inhibition of palmitoyl-CoA oxidation in rat heart mitochondria
Bioorg Med Chem Lett 14: 6017-21 (2004)
Article DOI: 10.1016/j.bmcl.2004.09.077
BindingDB Entry DOI: 10.7270/Q2ZS2W0R