BDBM50156438 (R)-1-{4-[3-(4-Isopropyl-phenyl)-[1,2,4]oxadiazol-5-ylmethyl]-piperazin-1-yl}-3-(2-methyl-benzothiazol-5-yloxy)-propan-2-ol::CHEMBL186843
SMILES: CC(C)c1ccc(cc1)-c1noc(CN2CCN(C[C@@H](O)COc3ccc4sc(C)nc4c3)CC2)n1
InChI Key: InChIKey=ILNJIQZGGVHSFH-JOCHJYFZSA-N
Data: 1 IC50
Activity Spreadsheet -- Enzyme Inhibition Constant Data from BindingDB
Found 1 hit for monomerid = 50156438
Trg + Lig
Ki
nM
ΔG°
kcal/mole
IC50
nM
Kd
nM
EC50/IC50
nM
koff
s-1
kon
M-1s-1
pHTemp
°C
Palmitoyl-CoA oxidase
(Rattus norvegicus)
BDBM50156438
((R)-1-{4-[3-(4-Isopropyl-phenyl)-[1,2,4]oxadiazol-...)
Show SMILES CC(C)c1ccc(cc1)-c1noc(CN2CCN(C[C@@H](O)COc3ccc4sc(C)nc4c3)CC2)n1
Show InChI InChI=1S/C27H33N5O3S/c1-18(2)20-4-6-21(7-5-20)27-29-26(35-30-27)16-32-12-10-31(11-13-32)15-22(33)17-34-23-8-9-25-24(14-23)28-19(3)36-25/h4-9,14,18,22,33H,10-13,15-17H2,1-3H3/t22-/m1/s1
Reactome pathway
n/an/a 1.23E+3n/an/an/an/an/an/a
CV Therapeutics, Inc.
Curated by ChEMBL
Assay Description
Inhibition of palmitoyl-CoA oxidation in rat heart mitochondria
Bioorg Med Chem Lett 14: 6017-21 (2004)
Article DOI: 10.1016/j.bmcl.2004.09.077
BindingDB Entry DOI: 10.7270/Q2ZS2W0R