BDBM50156525 2-Methyl-3-{4-[2-(5-methyl-2-phenyl-oxazol-4-yl)-ethoxy]-phenyl}-2-p-tolyloxy-propionic acid::CHEMBL366138
SMILES: Cc1oc(nc1CCOc1ccc(CC(C)(Oc2ccc(C)cc2)C(O)=O)cc1)-c1ccccc1
InChI Key: InChIKey=ZUUDQJNRQBHZTC-UHFFFAOYSA-N
Data: 2 IC50  2 EC50
Activity Spreadsheet -- Enzyme Inhibition Constant Data from BindingDB
Found 4 hits for monomerid = 50156525
Trg + Lig
Ki
nM
ΔG°
kcal/mole
IC50
nM
Kd
nM
EC50/IC50
nM
koff
s-1
kon
M-1s-1
pHTemp
°C
Peroxisome proliferator-activated receptor alpha
(Homo sapiens (Human))
BDBM50156525
(2-Methyl-3-{4-[2-(5-methyl-2-phenyl-oxazol-4-yl)-e...)
Show SMILES Cc1oc(nc1CCOc1ccc(CC(C)(Oc2ccc(C)cc2)C(O)=O)cc1)-c1ccccc1
Show InChI InChI=1S/C29H29NO5/c1-20-9-13-25(14-10-20)35-29(3,28(31)32)19-22-11-15-24(16-12-22)33-18-17-26-21(2)34-27(30-26)23-7-5-4-6-8-23/h4-16H,17-19H2,1-3H3,(H,31,32)
n/an/an/an/a 7n/an/an/an/a
Lilly Research Laboratories
Curated by ChEMBL
Assay Description
Transactivation activity for human Peroxisome proliferator activated receptor alpha
Bioorg Med Chem Lett 14: 6113-6 (2004)
Article DOI: 10.1016/j.bmcl.2004.09.031
BindingDB Entry DOI: 10.7270/Q2QN67J1
Peroxisome proliferator-activated receptor alpha
(Mus musculus)
BDBM50156525
(2-Methyl-3-{4-[2-(5-methyl-2-phenyl-oxazol-4-yl)-e...)
Show SMILES Cc1oc(nc1CCOc1ccc(CC(C)(Oc2ccc(C)cc2)C(O)=O)cc1)-c1ccccc1
Show InChI InChI=1S/C29H29NO5/c1-20-9-13-25(14-10-20)35-29(3,28(31)32)19-22-11-15-24(16-12-22)33-18-17-26-21(2)34-27(30-26)23-7-5-4-6-8-23/h4-16H,17-19H2,1-3H3,(H,31,32)
Reactome pathway
n/an/an/an/a 585n/an/an/an/a
Lilly Research Laboratories
Curated by ChEMBL
Assay Description
Transactivation activity for mouse Peroxisome proliferator activated receptor alpha
Bioorg Med Chem Lett 14: 6113-6 (2004)
Article DOI: 10.1016/j.bmcl.2004.09.031
BindingDB Entry DOI: 10.7270/Q2QN67J1
Peroxisome proliferator-activated receptor alpha
(Homo sapiens (Human))
BDBM50156525
(2-Methyl-3-{4-[2-(5-methyl-2-phenyl-oxazol-4-yl)-e...)
Show SMILES Cc1oc(nc1CCOc1ccc(CC(C)(Oc2ccc(C)cc2)C(O)=O)cc1)-c1ccccc1
Show InChI InChI=1S/C29H29NO5/c1-20-9-13-25(14-10-20)35-29(3,28(31)32)19-22-11-15-24(16-12-22)33-18-17-26-21(2)34-27(30-26)23-7-5-4-6-8-23/h4-16H,17-19H2,1-3H3,(H,31,32)
n/an/a 64n/an/an/an/an/an/a
Lilly Research Laboratories
Curated by ChEMBL
Assay Description
In vitro inhibition of human Peroxisome proliferator activated receptor alpha
Bioorg Med Chem Lett 14: 6113-6 (2004)
Article DOI: 10.1016/j.bmcl.2004.09.031
BindingDB Entry DOI: 10.7270/Q2QN67J1
Peroxisome proliferator-activated receptor alpha
(Mus musculus)
BDBM50156525
(2-Methyl-3-{4-[2-(5-methyl-2-phenyl-oxazol-4-yl)-e...)
Show SMILES Cc1oc(nc1CCOc1ccc(CC(C)(Oc2ccc(C)cc2)C(O)=O)cc1)-c1ccccc1
Show InChI InChI=1S/C29H29NO5/c1-20-9-13-25(14-10-20)35-29(3,28(31)32)19-22-11-15-24(16-12-22)33-18-17-26-21(2)34-27(30-26)23-7-5-4-6-8-23/h4-16H,17-19H2,1-3H3,(H,31,32)
Reactome pathway
n/an/a 1.40E+3n/an/an/an/an/an/a
Lilly Research Laboratories
Curated by ChEMBL
Assay Description
In vitro inhibition of mouse Peroxisome proliferator activated receptor alpha
Bioorg Med Chem Lett 14: 6113-6 (2004)
Article DOI: 10.1016/j.bmcl.2004.09.031
BindingDB Entry DOI: 10.7270/Q2QN67J1