BDBM50156549 4-(2-((S)-2-((S)-3-hydroxyoctyl)-5-oxopyrrolidin-1-yl)ethyl)benzoic acid::CHEMBL376347
SMILES: CCCCC[C@H](O)CC[C@H]1CCC(=O)N1CCc1ccc(cc1)C(O)=O
InChI Key: InChIKey=VQNWSLIWEXGOQR-OALUTQOASA-N
Data: 3 KI  1 EC50
Activity Spreadsheet -- Enzyme Inhibition Constant Data from BindingDB
Found 4 hits for monomerid = 50156549
Trg + Lig
Ki
nM
ΔG°
kcal/mole
IC50
nM
Kd
nM
EC50/IC50
nM
koff
s-1
kon
M-1s-1
pHTemp
°C
Prostaglandin E2 receptor EP4 subtype
(Homo sapiens (Human))
BDBM50156549
(4-(2-((S)-2-((S)-3-hydroxyoctyl)-5-oxopyrrolidin-1...)
Show SMILES CCCCC[C@H](O)CC[C@H]1CCC(=O)N1CCc1ccc(cc1)C(O)=O |r|
Show InChI InChI=1S/C21H31NO4/c1-2-3-4-5-19(23)12-10-18-11-13-20(24)22(18)15-14-16-6-8-17(9-7-16)21(25)26/h6-9,18-19,23H,2-5,10-15H2,1H3,(H,25,26)/t18-,19-/m0/s1
Reactome pathway
17n/an/an/an/an/an/an/an/a
Roche Palo Alto
Curated by ChEMBL
Assay Description
Binding affinity to human EP4 receptor
J Med Chem 47: 6124-7 (2004)
Article DOI: 10.1021/jm049290a
BindingDB Entry DOI: 10.7270/Q2P84BBQ
Prostaglandin E2 receptor EP2 subtype
(Homo sapiens (Human))
BDBM50156549
(4-(2-((S)-2-((S)-3-hydroxyoctyl)-5-oxopyrrolidin-1...)
Show SMILES CCCCC[C@H](O)CC[C@H]1CCC(=O)N1CCc1ccc(cc1)C(O)=O |r|
Show InChI InChI=1S/C21H31NO4/c1-2-3-4-5-19(23)12-10-18-11-13-20(24)22(18)15-14-16-6-8-17(9-7-16)21(25)26/h6-9,18-19,23H,2-5,10-15H2,1H3,(H,25,26)/t18-,19-/m0/s1
Reactome pathway
35n/an/an/an/an/an/an/an/a
Roche Palo Alto
Curated by ChEMBL
Assay Description
Binding affinity to human EP2 receptor
J Med Chem 47: 6124-7 (2004)
Article DOI: 10.1021/jm049290a
BindingDB Entry DOI: 10.7270/Q2P84BBQ
Prostaglandin E2 receptor
(Homo sapiens (Human))
BDBM50156549
(4-(2-((S)-2-((S)-3-hydroxyoctyl)-5-oxopyrrolidin-1...)
Show SMILES CCCCC[C@H](O)CC[C@H]1CCC(=O)N1CCc1ccc(cc1)C(O)=O |r|
Show InChI InChI=1S/C21H31NO4/c1-2-3-4-5-19(23)12-10-18-11-13-20(24)22(18)15-14-16-6-8-17(9-7-16)21(25)26/h6-9,18-19,23H,2-5,10-15H2,1H3,(H,25,26)/t18-,19-/m0/s1
9.03E+4n/an/an/an/an/an/an/an/a
Roche Palo Alto
Curated by ChEMBL
Assay Description
Binding affinity to human EP3 receptor
J Med Chem 47: 6124-7 (2004)
Article DOI: 10.1021/jm049290a
BindingDB Entry DOI: 10.7270/Q2P84BBQ
Prostaglandin E2 receptor EP4 subtype
(Homo sapiens (Human))
BDBM50156549
(4-(2-((S)-2-((S)-3-hydroxyoctyl)-5-oxopyrrolidin-1...)
Show SMILES CCCCC[C@H](O)CC[C@H]1CCC(=O)N1CCc1ccc(cc1)C(O)=O |r|
Show InChI InChI=1S/C21H31NO4/c1-2-3-4-5-19(23)12-10-18-11-13-20(24)22(18)15-14-16-6-8-17(9-7-16)21(25)26/h6-9,18-19,23H,2-5,10-15H2,1H3,(H,25,26)/t18-,19-/m0/s1
Reactome pathway
n/an/an/an/a 130n/an/an/an/a
Roche Palo Alto
Curated by ChEMBL
Assay Description
Functional activity at human EP4 receptor
J Med Chem 47: 6124-7 (2004)
Article DOI: 10.1021/jm049290a
BindingDB Entry DOI: 10.7270/Q2P84BBQ