BDBM50156584 1-(4-methanesulfonylphenyl)-3-[(3,4,5-trimethoxy)phenoxymethyl]-5-phenyl-1H-pyrazole::CHEMBL373434
SMILES: COc1cc(OCc2cc(-c3ccccc3)n(n2)-c2ccc(cc2)S(C)(=O)=O)cc(OC)c1OC
InChI Key: InChIKey=FRPMTGJEKAAEEN-UHFFFAOYSA-N
Data: 3 IC50
Activity Spreadsheet -- Enzyme Inhibition Constant Data from BindingDB
Found 3 hits for monomerid = 50156584
Trg + Lig
Ki
nM
ΔG°
kcal/mole
IC50
nM
Kd
nM
EC50/IC50
nM
koff
s-1
kon
M-1s-1
pHTemp
°C
Cyclooxygenase-1 (COX-1)
(Homo sapiens (Human))
BDBM50156584
(1-(4-methanesulfonylphenyl)-3-[(3,4,5-trimethoxy)p...)
Show SMILES COc1cc(OCc2cc(-c3ccccc3)n(n2)-c2ccc(cc2)S(C)(=O)=O)cc(OC)c1OC
Show InChI InChI=1S/C26H26N2O6S/c1-31-24-15-21(16-25(32-2)26(24)33-3)34-17-19-14-23(18-8-6-5-7-9-18)28(27-19)20-10-12-22(13-11-20)35(4,29)30/h5-16H,17H2,1-4H3
n/an/a 1.76E+4n/an/an/an/an/an/a
Université de Lille 2
Curated by ChEMBL
Assay Description
Inhibition of COX1 expressed in CHO cells assessed as inhibition of arachidonic acid-stimulated PGE2 production by enzyme immunoassay
J Med Chem 47: 6195-206 (2004)
Article DOI: 10.1021/jm0407761
BindingDB Entry DOI: 10.7270/Q2DR2V01
Arachidonate 5-lipoxygenase
(Homo sapiens (Human))
BDBM50156584
(1-(4-methanesulfonylphenyl)-3-[(3,4,5-trimethoxy)p...)
Show SMILES COc1cc(OCc2cc(-c3ccccc3)n(n2)-c2ccc(cc2)S(C)(=O)=O)cc(OC)c1OC
Show InChI InChI=1S/C26H26N2O6S/c1-31-24-15-21(16-25(32-2)26(24)33-3)34-17-19-14-23(18-8-6-5-7-9-18)28(27-19)20-10-12-22(13-11-20)35(4,29)30/h5-16H,17H2,1-4H3
Reactome pathway
n/an/a>1.00E+4n/an/an/an/an/an/a
Université de Lille 2
Curated by ChEMBL
Assay Description
Inhibition of 5LOX in human whole blood assessed as inhibition of calcium ionophore A 23187-stimulated 5HETE production by HPLC analysis
J Med Chem 47: 6195-206 (2004)
Article DOI: 10.1021/jm0407761
BindingDB Entry DOI: 10.7270/Q2DR2V01
Cyclooxygenase
(Homo sapiens (Human))
BDBM50156584
(1-(4-methanesulfonylphenyl)-3-[(3,4,5-trimethoxy)p...)
Show SMILES COc1cc(OCc2cc(-c3ccccc3)n(n2)-c2ccc(cc2)S(C)(=O)=O)cc(OC)c1OC
Show InChI InChI=1S/C26H26N2O6S/c1-31-24-15-21(16-25(32-2)26(24)33-3)34-17-19-14-23(18-8-6-5-7-9-18)28(27-19)20-10-12-22(13-11-20)35(4,29)30/h5-16H,17H2,1-4H3
NCI pathway
Reactome pathway
n/an/a 220n/an/an/an/an/an/a
Université de Lille 2
Curated by ChEMBL
Assay Description
Inhibition of COX2 expressed in CHO cells assessed as inhibition of arachidonic acid-stimulated PGE2 production by enzyme immunoassay
J Med Chem 47: 6195-206 (2004)
Article DOI: 10.1021/jm0407761
BindingDB Entry DOI: 10.7270/Q2DR2V01