BDBM50156594 3-[(3-fluoro-5-methoxy)phenoxymethyl]-1-(4-methanesulfonylphenyl)-5-phenyl-1H-pyrazole::CHEMBL375127
SMILES: COc1cc(F)cc(OCc2cc(-c3ccccc3)n(n2)-c2ccc(cc2)S(C)(=O)=O)c1
InChI Key: InChIKey=VZFWOGVRKBWPKJ-UHFFFAOYSA-N
Data: 3 IC50
Activity Spreadsheet -- Enzyme Inhibition Constant Data from BindingDB
Found 3 hits for monomerid = 50156594
Trg + Lig
Ki
nM
ΔG°
kcal/mole
IC50
nM
Kd
nM
EC50/IC50
nM
koff
s-1
kon
M-1s-1
pHTemp
°C
Cyclooxygenase-1 (COX-1)
(Homo sapiens (Human))
BDBM50156594
(3-[(3-fluoro-5-methoxy)phenoxymethyl]-1-(4-methane...)
Show SMILES COc1cc(F)cc(OCc2cc(-c3ccccc3)n(n2)-c2ccc(cc2)S(C)(=O)=O)c1
Show InChI InChI=1S/C24H21FN2O4S/c1-30-21-12-18(25)13-22(15-21)31-16-19-14-24(17-6-4-3-5-7-17)27(26-19)20-8-10-23(11-9-20)32(2,28)29/h3-15H,16H2,1-2H3
n/an/a 4.43E+4n/an/an/an/an/an/a
Université de Lille 2
Curated by ChEMBL
Assay Description
Inhibition of COX1 expressed in CHO cells assessed as inhibition of arachidonic acid-stimulated PGE2 production by enzyme immunoassay
J Med Chem 47: 6195-206 (2004)
Article DOI: 10.1021/jm0407761
BindingDB Entry DOI: 10.7270/Q2DR2V01
Arachidonate 5-lipoxygenase
(Homo sapiens (Human))
BDBM50156594
(3-[(3-fluoro-5-methoxy)phenoxymethyl]-1-(4-methane...)
Show SMILES COc1cc(F)cc(OCc2cc(-c3ccccc3)n(n2)-c2ccc(cc2)S(C)(=O)=O)c1
Show InChI InChI=1S/C24H21FN2O4S/c1-30-21-12-18(25)13-22(15-21)31-16-19-14-24(17-6-4-3-5-7-17)27(26-19)20-8-10-23(11-9-20)32(2,28)29/h3-15H,16H2,1-2H3
Reactome pathway
n/an/a>1.00E+4n/an/an/an/an/an/a
Université de Lille 2
Curated by ChEMBL
Assay Description
Inhibition of 5LOX in human whole blood assessed as inhibition of calcium ionophore A 23187-stimulated 5HETE production by HPLC analysis
J Med Chem 47: 6195-206 (2004)
Article DOI: 10.1021/jm0407761
BindingDB Entry DOI: 10.7270/Q2DR2V01
Cyclooxygenase
(Homo sapiens (Human))
BDBM50156594
(3-[(3-fluoro-5-methoxy)phenoxymethyl]-1-(4-methane...)
Show SMILES COc1cc(F)cc(OCc2cc(-c3ccccc3)n(n2)-c2ccc(cc2)S(C)(=O)=O)c1
Show InChI InChI=1S/C24H21FN2O4S/c1-30-21-12-18(25)13-22(15-21)31-16-19-14-24(17-6-4-3-5-7-17)27(26-19)20-8-10-23(11-9-20)32(2,28)29/h3-15H,16H2,1-2H3
NCI pathway
Reactome pathway
n/an/a 310n/an/an/an/an/an/a
Université de Lille 2
Curated by ChEMBL
Assay Description
Inhibition of COX2 expressed in CHO cells assessed as inhibition of arachidonic acid-stimulated PGE2 production by enzyme immunoassay
J Med Chem 47: 6195-206 (2004)
Article DOI: 10.1021/jm0407761
BindingDB Entry DOI: 10.7270/Q2DR2V01