BDBM50156677 CHEMBL3792704
SMILES: CCc1c(noc1-c1ccccn1)-c1nc(no1)-c1ccc(CN2CC(C2)C(O)=O)cc1
InChI Key: InChIKey=CRTFNLYUCMUSJG-UHFFFAOYSA-N
Data: 2 EC50
PDB links: 1 PDB ID matches this monomer.
Activity Spreadsheet -- Enzyme Inhibition Constant Data from BindingDB
Found 2 hits for monomerid = 50156677
Trg + Lig
Ki
nM
ΔG°
kcal/mole
IC50
nM
Kd
nM
EC50/IC50
nM
koff
s-1
kon
M-1s-1
pHTemp
°C
Sphingosine 1-phosphate receptor 1
(Homo sapiens (Human))
BDBM50156677
(CHEMBL3792704)
Show SMILES CCc1c(noc1-c1ccccn1)-c1nc(no1)-c1ccc(CN2CC(C2)C(O)=O)cc1
Show InChI InChI=1S/C23H21N5O4/c1-2-17-19(26-31-20(17)18-5-3-4-10-24-18)22-25-21(27-32-22)15-8-6-14(7-9-15)11-28-12-16(13-28)23(29)30/h3-10,16H,2,11-13H2,1H3,(H,29,30)
Reactome pathway
n/an/an/an/a 3.40n/an/an/an/a
Bristol-Myers Squibb Research and Development
Curated by ChEMBL
Assay Description
Agonist activity at human S1P1 receptor expressed in CHO cell membranes assessed as stimulation of [35S]GTPgamma binding incubated for 45 mins by liq...
Bioorg Med Chem Lett 26: 2470-4 (2016)
BindingDB Entry DOI: 10.7270/Q23T9K3M
Sphingosine 1-phosphate receptor 3
(Homo sapiens (Human))
BDBM50156677
(CHEMBL3792704)
Show SMILES CCc1c(noc1-c1ccccn1)-c1nc(no1)-c1ccc(CN2CC(C2)C(O)=O)cc1
Show InChI InChI=1S/C23H21N5O4/c1-2-17-19(26-31-20(17)18-5-3-4-10-24-18)22-25-21(27-32-22)15-8-6-14(7-9-15)11-28-12-16(13-28)23(29)30/h3-10,16H,2,11-13H2,1H3,(H,29,30)
NCI pathway
Reactome pathway
n/an/an/an/a 1.90E+3n/an/an/an/a
Bristol-Myers Squibb Research and Development
Curated by ChEMBL
Assay Description
Agonist activity at human S1P3 receptor expressed in EDG3-Ga15-bla HEK293T cell membranes assessed as stimulation of [35S]GTPgamma binding incubated ...
Bioorg Med Chem Lett 26: 2470-4 (2016)
BindingDB Entry DOI: 10.7270/Q23T9K3M