BDBM50156741 (S)-3-(4-(isobutyl(methyl)amino)-6-(pyrrolidin-3-ylamino)-1,3,5-triazin-2-ylamino)-4-methylbenzamide::CHEMBL426902
SMILES: CC(C)CN(C)c1nc(N[C@H]2CCNC2)nc(Nc2cc(ccc2C)C(N)=O)n1
InChI Key: InChIKey=GLZVGITYALULNP-HNNXBMFYSA-N
Data: 1 IC50
Activity Spreadsheet -- Enzyme Inhibition Constant Data from BindingDB
Found 1 hit for monomerid = 50156741
Trg + Lig
Ki
nM
ΔG°
kcal/mole
IC50
nM
Kd
nM
EC50/IC50
nM
koff
s-1
kon
M-1s-1
pHTemp
°C
Mitogen-activated protein kinase 14
(Homo sapiens (Human))
BDBM50156741
((S)-3-(4-(isobutyl(methyl)amino)-6-(pyrrolidin-3-y...)
Show SMILES CC(C)CN(C)c1nc(N[C@H]2CCNC2)nc(Nc2cc(ccc2C)C(N)=O)n1 |r|
Show InChI InChI=1S/C20H30N8O/c1-12(2)11-28(4)20-26-18(23-15-7-8-22-10-15)25-19(27-20)24-16-9-14(17(21)29)6-5-13(16)3/h5-6,9,12,15,22H,7-8,10-11H2,1-4H3,(H2,21,29)(H2,23,24,25,26,27)/t15-/m0/s1
NCI pathway
Reactome pathway
n/an/a 28n/an/an/an/an/an/a
Bristol-Myers Squibb
Curated by ChEMBL
Assay Description
Inhibition of human p38-alpha expressed in Escherichia coli
J Med Chem 47: 6283-91 (2004)
Article DOI: 10.1021/jm049521d
BindingDB Entry DOI: 10.7270/Q2WS8SR1